Compare commits

...

10 commits

Author SHA1 Message Date
54065e9ce4
stride indexing: reconstruction mapped i*S+K -> i*(S+K); fixed aah collectWingPartCached (AIOOBE 18/17 crash on cosmetics backpack) + 34 sites in asl/aue/ahw/aul/up/uw/vh/ahn readers vs orig bytecode 2026-10-04 13:34:39 +02:00
b9abbcd95d
color unpack: restore missing &0xFF masks in asv.red/green/alpha, asu.fromInt/mixRGB, asv.hexToRgb (theme colors zeroed -> invisible GUI text); adx.isOwned return all-until-confirmed; drop EVO-DBG probes; ignore build-logs/ 2026-10-04 13:20:49 +02:00
749e40339a
aem.mirrored: array size length*0 -> length*2-2; runClient clean session (user closed) 2026-10-04 11:37:17 +02:00
230a0ffb82
runtime fixes: move own-class singleton init below static{} (18 files), ux circle stride *3->*2+1, ara scratch cursor mask; runClient reaches menu 2026-10-03 20:23:58 +02:00
9a98af08a4
postbuild: CP tag 15 (MethodHandle) + rename Cif/Cdo class files to if/do; BUILD SUCCESSFUL 2026-10-03 17:44:06 +02:00
036d94952c
EF waves N+35–N+43: lambda captures in 30 files (aph..zz), compileJava green 2026-10-03 17:39:02 +02:00
51b4c3cef2
wave N+34: aoz encryptData throws Exception (precise rethrow) 2026-10-03 16:41:28 +02:00
c427486350
wave N+33: aox EF lambda copy (var0 in speaker evict) 2026-10-03 16:38:39 +02:00
5c4ba74dbf
wave N+32: aoh EF lambda copy (var1 in remotes removeIf) 2026-10-03 16:37:17 +02:00
cec059f900
wave N+31: aod EF lambda copies (close daemon, reap execute) 2026-10-03 16:35:48 +02:00
132 changed files with 14174 additions and 265 deletions

1
.gitignore vendored
View file

@ -1,4 +1,5 @@
build/ build/
build-logs/
.gradle/ .gradle/
.idea/ .idea/
dist/ dist/

36
build-logs/fullbuild1.log Normal file
View file

@ -0,0 +1,36 @@
> Configure project :
Fabric Loom: 1.17.12
> Task :compileJava UP-TO-DATE
> Task :processResources
> Task :classes
> Task :postprocessClasses FAILED
Traceback (most recent call last):
File "/storage/aboba/evovis-client/tools/postbuild.py", line 133, in <module>
sys.exit(main())
~~~~^^
File "/storage/aboba/evovis-client/tools/postbuild.py", line 122, in main
moved, touched = process_dir(target)
~~~~~~~~~~~^^^^^^^^
File "/storage/aboba/evovis-client/tools/postbuild.py", line 77, in process_dir
new = rewrite_class(data)
File "/storage/aboba/evovis-client/tools/postbuild.py", line 57, in rewrite_class
raise ValueError(f"unknown constant pool tag {tag} at offset {i - 1}")
ValueError: unknown constant pool tag 15 at offset 6234
FAILURE: Build failed with an exception.
* What went wrong:
Execution failed for task ':postprocessClasses' (registered in build file 'build.gradle').
> Process 'command 'python3'' finished with non-zero exit value 1
* Try:
> Run with --stacktrace option to get the stack trace.
> Run with --info or --debug option to get more log output.
> Run with --scan to get full insights from a Build Scan (powered by Develocity).
> Get more help at https://help.gradle.org.
BUILD FAILED in 6s
3 actionable tasks: 2 executed, 1 up-to-date

32
build-logs/fullbuild2.log Normal file
View file

@ -0,0 +1,32 @@
> Configure project :
Fabric Loom: 1.17.12
> Task :compileJava
Note: Some input files use or override a deprecated API.
Note: Recompile with -Xlint:deprecation for details.
Note: Some input files use unchecked or unsafe operations.
Note: Recompile with -Xlint:unchecked for details.
> Task :processResources UP-TO-DATE
> Task :classes
> Task :postprocessClasses
postbuild: moved=1311 rewritten=105 (/storage/aboba/evovis-client/build/classes/java/main)
> Task :processIncludeJars
> Task :compileTestJava NO-SOURCE
> Task :processTestResources NO-SOURCE
> Task :testClasses UP-TO-DATE
> Task :test NO-SOURCE
> Task :jar
> Task :validateAccessWidener
> Task :assemble
> Task :check
> Task :build
[Incubating] Problems report is available at: file:///storage/aboba/evovis-client/build/reports/problems/problems-report.html
BUILD SUCCESSFUL in 28s
6 actionable tasks: 5 executed, 1 up-to-date
Consider enabling configuration cache to speed up this build: https://docs.gradle.org/9.5.0/userguide/configuration_cache_enabling.html

25
build-logs/fullbuild3.log Normal file
View file

@ -0,0 +1,25 @@
> Configure project :
Fabric Loom: 1.17.12
> Task :compileJava UP-TO-DATE
> Task :processResources UP-TO-DATE
> Task :classes UP-TO-DATE
> Task :postprocessClasses
postbuild: moved=2 rewritten=0 (/storage/aboba/evovis-client/build/classes/java/main)
> Task :processIncludeJars UP-TO-DATE
> Task :compileTestJava NO-SOURCE
> Task :processTestResources NO-SOURCE
> Task :testClasses UP-TO-DATE
> Task :test NO-SOURCE
> Task :validateAccessWidener UP-TO-DATE
> Task :check UP-TO-DATE
> Task :jar
> Task :assemble
> Task :build
BUILD SUCCESSFUL in 8s
6 actionable tasks: 2 executed, 4 up-to-date
Consider enabling configuration cache to speed up this build: https://docs.gradle.org/9.5.0/userguide/configuration_cache_enabling.html

343
build-logs/runclient1.log Normal file
View file

@ -0,0 +1,343 @@
Starting a Gradle Daemon (subsequent builds will be faster)
> Configure project :
Fabric Loom: 1.17.12
> Task :compileJava
Note: Some input files use or override a deprecated API.
Note: Recompile with -Xlint:deprecation for details.
Note: Some input files use unchecked or unsafe operations.
Note: Recompile with -Xlint:unchecked for details.
> Task :processResources UP-TO-DATE
> Task :classes
> Task :generateLog4jConfig
> Task :generateDLIConfig
> Task :configureLaunch
> Task :downloadAssets
> Task :configureClientLaunch
> Task :postprocessClasses
postbuild: moved=1311 rewritten=105 (/storage/aboba/evovis-client/build/classes/java/main)
> Task :runClient
[19:15:51] [main/INFO] (FabricLoader/GameProvider) Loading Minecraft 26.2 with Fabric Loader 0.19.5
[19:15:51] [main/INFO] (FabricLoader/Mappings) Mappings not present!
[19:15:52] [main/INFO] (FabricLoader) Loading 72 mods:
- ai_djl_api 0.32.0
- ai_djl_pytorch_pytorch-engine 0.32.0
- com_viaversion_viaversion-common 5.12.0
- evolutiondlc 2026.10.1.994
- fabric-api 0.159.0+26.2
- fabric-api-base 2.0.4+ece063239e
- fabric-api-lookup-api-v1 2.0.18+11e1c9a39e
- fabric-biome-api-v1 18.0.6+c7bd5b8e9e
- fabric-block-api-v1 3.0.3+ec56b6019e
- fabric-block-getter-api-v2 2.0.7+ec56b6019e
- fabric-client-gametest-api-v1 6.0.1+0f4f1dca9e
- fabric-command-api-v2 3.1.0+00cb03469e
- fabric-content-registries-v0 11.3.2+37b1aa249e
- fabric-convention-tags-v2 4.7.1+1f023a9e9e
- fabric-crash-report-info-v1 1.0.5+086d547a9e
- fabric-creative-tab-api-v1 5.0.14+d871b99e9e
- fabric-data-attachment-api-v1 2.2.18+515ac5339e
- fabric-data-generation-api-v1 25.5.1+aed122aa9e
- fabric-debug-api-v1 1.0.2+c792624d9e
- fabric-dimensions-v1 5.1.12+515ac5339e
- fabric-entity-events-v1 5.0.5+06488ac19e
- fabric-events-interaction-v0 5.2.7+515ac5339e
- fabric-game-rule-api-v1 4.0.8+46a6d00c9e
- fabric-gametest-api-v1 4.0.21+4a7fa0819e
- fabric-item-api-v1 14.5.0+c68f6cbe9e
- fabric-key-mapping-api-v1 2.0.5+e2bdee789e
- fabric-lifecycle-events-v1 4.1.4+29b6eb019e
- fabric-loot-api-v3 3.0.17+06488ac19e
- fabric-menu-api-v1 2.0.16+086d547a9e
- fabric-message-api-v1 7.0.8+bb2ed3f79e
- fabric-model-loading-api-v1 8.0.17+c80601bb9e
- fabric-networking-api-v1 6.3.3+72073ef09e
- fabric-object-builder-api-v1 24.1.0+6fcd5f039e
- fabric-particles-v1 5.0.18+d1756aa99e
- fabric-permission-api-v1 1.0.5+e442d8d09e
- fabric-recipe-api-v1 9.0.21+11e1c9a39e
- fabric-registry-sync-v0 7.1.0+c7bd5b8e9e
- fabric-renderer-api-v1 14.1.4+2b0d8a229e
- fabric-renderer-indigo 9.1.4+2b0d8a229e
- fabric-rendering-fluids-v1 6.0.4+06488ac19e
- fabric-rendering-v1 25.3.3+515ac5339e
- fabric-resource-conditions-api-v1 6.1.0+10e9a28b9e
- fabric-resource-loader-v0 3.3.20+4fc5413f9e
- fabric-resource-loader-v1 2.0.13+9edec1269e
- fabric-screen-api-v1 5.2.1+5087f8249e
- fabric-serialization-api-v1 2.0.4+11a26f319e
- fabric-sound-api-v1 2.0.5+11a26f319e
- fabric-tag-api-v1 2.1.4+515ac5339e
- fabric-transfer-api-v1 8.0.13+11dbb7d79e
- fabric-transitive-access-wideners-v1 8.1.4+67c847259e
- fabricloader 0.19.5
- io_github_givimad_whisper-jni 1.7.1
- java 25
- minecraft 26.2
- mixinextras 0.5.5
- org_jcodec_jcodec 0.2.5
- org_luaj_luaj-jse 3.0.1
- viafabricplus 5.0.2
|-- com_seedfinding_mc_biome 1.171.1
|-- com_seedfinding_mc_core 1.210.0
|-- com_seedfinding_mc_math 1.171.0
|-- com_seedfinding_mc_noise 1.171.1
|-- com_seedfinding_mc_seed 1.171.2
|-- com_viaversion_viaaprilfools-common 4.2.3
|-- com_viaversion_viabackwards-common 5.12.0
|-- de_florianreuth_classic4j 2.3.1
|-- net_lenni0451_commons_unchecked 1.9.2
|-- net_lenni0451_reflect 1.6.4
\-- net_raphimc_vialegacy 3.1.0
- viafabricplus-api 5.0.2
- voicechat 2.6.21+26.2
\-- voicechat_api 2.6.20
[19:15:52] [main/INFO] (FabricLoader/Mixin) SpongePowered MIXIN Subsystem Version=0.8.7 Source=file:/storage/gradle/caches/modules-2/files-2.1/net.fabricmc/sponge-mixin/0.17.4+mixin.0.8.7/5f66cc9f59b8efaa942155a3d5a30599bf6640dd/sponge-mixin-0.17.4+mixin.0.8.7.jar Service=Knot/Fabric Env=CLIENT
[19:15:54] [main/WARN] (FabricLoader/Mixin) Error loading class: net/caffeinemc/mods/sodium/client/model/light/data/LightDataAccess (java.lang.ClassNotFoundException: net/caffeinemc/mods/sodium/client/model/light/data/LightDataAccess)
[19:15:54] [main/WARN] (FabricLoader/Mixin) Error loading class: net/caffeinemc/mods/sodium/client/render/chunk/compile/pipeline/BlockRenderer (java.lang.ClassNotFoundException: net/caffeinemc/mods/sodium/client/render/chunk/compile/pipeline/BlockRenderer)
[19:15:54] [main/WARN] (FabricLoader/Mixin) Error loading class: net/caffeinemc/mods/sodium/client/render/model/AbstractBlockRenderContext (java.lang.ClassNotFoundException: net/caffeinemc/mods/sodium/client/render/model/AbstractBlockRenderContext)
[19:15:54] [main/WARN] (FabricLoader/Mixin) Error loading class: com/replaymod/replaystudio/protocol/packets/PacketTeam (java.lang.ClassNotFoundException: com/replaymod/replaystudio/protocol/packets/PacketTeam)
[19:15:54] [main/WARN] (FabricLoader/Mixin) Error loading class: com/replaymod/replaystudio/lib/viaversion/api/data/MappingDataLoader (java.lang.ClassNotFoundException: com/replaymod/replaystudio/lib/viaversion/api/data/MappingDataLoader)
[19:15:54] [main/WARN] (FabricLoader/Mixin) Error loading class: com/replaymod/replaystudio/lib/viaversion/protocols/v1_12_2to1_13/data/MappingData1_13 (java.lang.ClassNotFoundException: com/replaymod/replaystudio/lib/viaversion/protocols/v1_12_2to1_13/data/MappingData1_13)
[19:15:54] [main/WARN] (FabricLoader/Mixin) Error loading class: com/replaymod/replaystudio/lib/viaversion/protocols/v1_12_2to1_13/data/RecipeData (java.lang.ClassNotFoundException: com/replaymod/replaystudio/lib/viaversion/protocols/v1_12_2to1_13/data/RecipeData)
[19:15:54] [main/WARN] (FabricLoader/Mixin) Error loading class: com/replaymod/replaystudio/lib/viaversion/protocols/v1_12_2to1_13/data/BlockIdData (java.lang.ClassNotFoundException: com/replaymod/replaystudio/lib/viaversion/protocols/v1_12_2to1_13/data/BlockIdData)
[19:15:55] [main/INFO] (FabricLoader/MixinExtras|Service) Initializing MixinExtras via com.llamalad7.mixinextras.service.MixinExtrasServiceImpl(version=0.5.5).
[19:15:57] [Via-Mappingloader-1/INFO] (ViaVersion) Loading block connection mappings ...
[19:15:57] [Worker-Main-1/INFO] (ViaBackwards) Loading translations...
[19:15:57] [Worker-Main-1/INFO] (ViaBackwards) Registering protocols...
[19:15:58] [Worker-Main-1/INFO] (ViaVersion) ViaVersion detected lowest supported version by the proxy: c0.0.15a-1 (0)
[19:15:58] [Worker-Main-1/INFO] (ViaVersion) Highest supported version by the proxy: 26.3 (777)
[19:15:58] [Worker-Main-1/INFO] (Minecraft) Environment: Environment[sessionHost=https://sessionserver.mojang.com, servicesHost=https://api.minecraftservices.com, profilesHost=https://api.mojang.com, name=PROD]
[19:15:59] [Datafixer Bootstrap #0/INFO] (Minecraft) 295 Datafixer optimizations took 698 milliseconds
[19:15:59] [Via Async Scheduler 0/INFO] (ViaVersion) Finished mapping loading, shutting down loader executor.
[19:16:06] [Render thread/INFO] (Minecraft) Environment: Environment[sessionHost=https://sessionserver.mojang.com, servicesHost=https://api.minecraftservices.com, profilesHost=https://api.mojang.com, name=PROD]
[19:16:06] [Render thread/INFO] (Minecraft) Setting user: Player395
[19:16:06] [Render thread/WARN] (voicechat) [voicechat/Voicechat] Running in debug mode - Don't leave this enabled in production!
[19:16:06] [Render thread/INFO] (voicechat) [voicechat/Voicechat] Compatibility version 20
[19:16:07] [Render thread/INFO] (voicechat) [voicechat/PluginManager] Loading plugins
[19:16:07] [Render thread/INFO] (voicechat) [voicechat/PluginManager] Loaded 1 plugin(s)
[19:16:07] [Render thread/INFO] (voicechat) [voicechat/PluginManager] Initializing plugins
[19:16:07] [Render thread/INFO] (voicechat) [voicechat/PluginManager] Initialized 1 plugin(s)
[19:16:07] [Render thread/INFO] (voicechat) [voicechat/PluginManager] Registering events for 'evolutiondlc'
[19:16:07] [Render thread/INFO] (voicechat) [voicechat/ViaVersionCompatibility] Successfully registered ViaVersion mappings
[19:16:07] [Render thread/INFO] (Minecraft) [STDOUT]: Using parent class loader: net.fabricmc.loader.impl.launch.knot.KnotClassLoader@13a5fe33
[19:16:08] [Render thread/INFO] (holdmyitems) What you staring at?
[19:16:09] [Render thread/INFO] (voicechat) [voicechat/NativeValidator] Initializing Opus
[19:16:09] [Render thread/INFO] (voicechat) [voicechat/NativeValidator] Successfully initialized Opus
[19:16:09] [Render thread/INFO] (voicechat) [voicechat/NativeValidator] Initializing RNNoise
[19:16:09] [Render thread/INFO] (voicechat) [voicechat/NativeValidator] Successfully initialized RNNoise
[19:16:09] [Render thread/INFO] (voicechat) [voicechat/NativeValidator] Initializing Speex
[19:16:09] [Render thread/INFO] (voicechat) [voicechat/NativeValidator] Successfully initialized Speex
[19:16:09] [Render thread/INFO] (voicechat) [voicechat/NativeValidator] Initializing LAME
[19:16:09] [Render thread/INFO] (voicechat) [voicechat/NativeValidator] Successfully initialized LAME
[19:16:09] [Render thread/INFO] (Indigo) [Indigo] Registering Indigo renderer!
[19:16:10] [Render thread/INFO] (Minecraft) Backend library: LWJGL version 3.4.1-snapshot
[19:16:11] [Render thread/INFO] (Minecraft) Using graphics backend OpenGL, using drivers: 4.6 (Core Profile) Mesa 26.2.3-arch1.1
[19:16:11] [Render thread/INFO] (Minecraft) Using graphics device: AMD Radeon RX 470 Graphics (radeonsi, polaris10, ACO, DRM 3.64, 7.2.7-arch1-1) (AMD)
[19:16:11] [Render thread/INFO] (Minecraft) Using graphics device extensions: GL_ARB_multi_draw_indirect, GL_ARB_buffer_storage, GL_ARB_shader_draw_parameters, GL_ARB_base_instance, GL_KHR_debug, GL_ARB_draw_indirect, GL_ARB_clip_control, GL_ARB_vertex_attrib_binding, GL_ARB_direct_state_access, GL_EXT_texture_filter_anisotropic
---- Minecraft Crash Report ----
// Daisy, daisy...
Time: 2026-10-03 19:16:12
Description: Initializing game
java.lang.ExceptionInInitializerError
at knot//lc.registerRender(lc.java:109)
at knot//lc.init(lc.java:65)
at knot//lc.<init>(lc.java:13)
at knot//bz.init(bz.java:66)
at knot//net.minecraft.client.Minecraft.handler$cci000$evolutiondlc$init(Minecraft.java:10156)
at knot//net.minecraft.client.Minecraft.<init>(Minecraft.java:553)
at knot//net.minecraft.client.main.Main.main(Main.java:278)
at net.fabricmc.loader.impl.game.minecraft.MinecraftGameProvider.launch(MinecraftGameProvider.java:517)
at net.fabricmc.loader.impl.launch.knot.Knot.launch(Knot.java:72)
at net.fabricmc.loader.impl.launch.knot.KnotClient.main(KnotClient.java:23)
at net.fabricmc.devlaunchinjector.Main.main(Main.java:86)
Caused by: java.lang.NullPointerException: Cannot read the array length because "var3" is null
at knot//sg.<init>(sg.java:19)
at knot//uf.buildModeSetting(uf.java:252)
at knot//uf.<init>(uf.java:17)
at knot//uf.<clinit>(uf.java:10)
... 11 more
A detailed walkthrough of the error, its code path and all known details is as follows:
---------------------------------------------------------------------------------------
-- Head --
Thread: Render thread
Stacktrace:
at knot//lc.registerRender(lc.java:109)
at knot//lc.init(lc.java:65)
at knot//lc.<init>(lc.java:13)
at knot//bz.init(bz.java:66)
at knot//net.minecraft.client.Minecraft.handler$cci000$evolutiondlc$init(Minecraft.java:10156)
at knot//net.minecraft.client.Minecraft.<init>(Minecraft.java:553)
-- Initialization --
Details:
Modules:
Stacktrace:
at knot//net.minecraft.client.main.Main.main(Main.java:278)
at net.fabricmc.loader.impl.game.minecraft.MinecraftGameProvider.launch(MinecraftGameProvider.java:517)
at net.fabricmc.loader.impl.launch.knot.Knot.launch(Knot.java:72)
at net.fabricmc.loader.impl.launch.knot.KnotClient.main(KnotClient.java:23)
at net.fabricmc.devlaunchinjector.Main.main(Main.java:86)
-- System Details --
Details:
Minecraft Version: 26.2
Minecraft Version ID: 26.2
Operating System: Linux (amd64) version 7.2.7-arch1-1
Java Version: 25.0.4.1, Arch Linux
Java VM Version: OpenJDK 64-Bit Server VM (mixed mode, sharing), Arch Linux
Memory: 77335496 bytes (73 MiB) / 559939584 bytes (534 MiB) up to 4148166656 bytes (3956 MiB)
Memory (heap): init: 248MiB, used: 456MiB, committed: 534MiB, max: 3956MiB
Memory (non-head): init: 007MiB, used: 167MiB, committed: 171MiB, max: 000MiB
CPUs: 24
Processor Vendor: GenuineIntel
Processor Name: Intel(R) Xeon(R) CPU E5-2680 v3 @ 2.50GHz
Identifier: Intel64 Family 6 Model 63 Stepping 2
Microarchitecture: Haswell (Server)
Frequency (GHz): 2.50
Number of physical packages: 1
Number of physical CPUs: 12
Number of logical CPUs: 24
Graphics card #0 name: Ellesmere [Radeon RX 470/480/570/570X/580/580X/590]
Graphics card #0 vendor: Advanced Micro Devices, Inc. [AMD/ATI] (0x1002)
Graphics card #0 VRAM (MiB): 258.00
Graphics card #0 deviceId: 0x67df
Graphics card #0 versionInfo: unknown
Virtual memory max (MiB): 16100.76
Virtual memory used (MiB): 17873.79
Swap memory total (MiB): 8192.00
Swap memory used (MiB): 6036.64
Space in storage for jna.tmpdir (MiB): <path not set>
Space in storage for org.lwjgl.system.SharedLibraryExtractPath (MiB): <path not set>
Space in storage for io.netty.native.workdir (MiB): <path not set>
Space in storage for java.io.tmpdir (MiB): available: 7686.38, total: 7908.77
Space in storage for workdir (MiB): available: 693285.13, total: 953868.69
Operating System Version: GNU/Linux Arch Linux unknown (unknown) build 7.2.7-arch1-1
Process Elevated: false
Process Loads: Uptime: 25s, user: 64s (253.03%), kernel: 2s (7.88%), total: 66s (260.92%)
Process Virtual Size (MiB): 7616.26
Process Resident Size (MiB): 951.53
JVM Flags: 0 total;
Debug Flags: 0 total;
Fabric Mods:
ai_djl_api: api 0.32.0
ai_djl_pytorch_pytorch-engine: pytorch-engine 0.32.0
com_viaversion_viaversion-common: viaversion-common 5.12.0
evolutiondlc: EvolutionDLC 2026.10.1.994
fabric-api: Fabric API 0.159.0+26.2
fabric-api-base: Fabric API Base 2.0.4+ece063239e
fabric-api-lookup-api-v1: Fabric API Lookup API (v1) 2.0.18+11e1c9a39e
fabric-biome-api-v1: Fabric Biome API (v1) 18.0.6+c7bd5b8e9e
fabric-block-api-v1: Fabric Block API (v1) 3.0.3+ec56b6019e
fabric-block-getter-api-v2: Fabric BlockGetter API (v2) 2.0.7+ec56b6019e
fabric-client-gametest-api-v1: Fabric Client Game Test API (v1) 6.0.1+0f4f1dca9e
fabric-command-api-v2: Fabric Command API (v2) 3.1.0+00cb03469e
fabric-content-registries-v0: Fabric Content Registries (v0) 11.3.2+37b1aa249e
fabric-convention-tags-v2: Fabric Convention Tags (v2) 4.7.1+1f023a9e9e
fabric-crash-report-info-v1: Fabric Crash Report Info (v1) 1.0.5+086d547a9e
fabric-creative-tab-api-v1: Fabric Creative Tab API (v1) 5.0.14+d871b99e9e
fabric-data-attachment-api-v1: Fabric Data Attachment API (v1) 2.2.18+515ac5339e
fabric-data-generation-api-v1: Fabric Data Generation API (v1) 25.5.1+aed122aa9e
fabric-debug-api-v1: Fabric Debug API (v1) 1.0.2+c792624d9e
fabric-dimensions-v1: Fabric Dimensions API (v1) 5.1.12+515ac5339e
fabric-entity-events-v1: Fabric Entity Events (v1) 5.0.5+06488ac19e
fabric-events-interaction-v0: Fabric Events Interaction (v0) 5.2.7+515ac5339e
fabric-game-rule-api-v1: Fabric Game Rule API (v1) 4.0.8+46a6d00c9e
fabric-gametest-api-v1: Fabric Game Test API (v1) 4.0.21+4a7fa0819e
fabric-item-api-v1: Fabric Item API (v1) 14.5.0+c68f6cbe9e
fabric-key-mapping-api-v1: Fabric Key Mapping API (v1) 2.0.5+e2bdee789e
fabric-lifecycle-events-v1: Fabric Lifecycle Events (v1) 4.1.4+29b6eb019e
fabric-loot-api-v3: Fabric Loot API (v3) 3.0.17+06488ac19e
fabric-menu-api-v1: Fabric Menu API (v1) 2.0.16+086d547a9e
fabric-message-api-v1: Fabric Message API (v1) 7.0.8+bb2ed3f79e
fabric-model-loading-api-v1: Fabric Model Loading API (v1) 8.0.17+c80601bb9e
fabric-networking-api-v1: Fabric Networking API (v1) 6.3.3+72073ef09e
fabric-object-builder-api-v1: Fabric Object Builder API (v1) 24.1.0+6fcd5f039e
fabric-particles-v1: Fabric Particles (v1) 5.0.18+d1756aa99e
fabric-permission-api-v1: Fabric Permission API (v1) 1.0.5+e442d8d09e
fabric-recipe-api-v1: Fabric Recipe API (v1) 9.0.21+11e1c9a39e
fabric-registry-sync-v0: Fabric Registry Sync (v0) 7.1.0+c7bd5b8e9e
fabric-renderer-api-v1: Fabric Renderer API (v1) 14.1.4+2b0d8a229e
fabric-renderer-indigo: Fabric Renderer - Indigo 9.1.4+2b0d8a229e
fabric-rendering-fluids-v1: Fabric Rendering Fluids (v1) 6.0.4+06488ac19e
fabric-rendering-v1: Fabric Rendering (v1) 25.3.3+515ac5339e
fabric-resource-conditions-api-v1: Fabric Resource Conditions API (v1) 6.1.0+10e9a28b9e
fabric-resource-loader-v0: Fabric Resource Loader (v0) 3.3.20+4fc5413f9e
fabric-resource-loader-v1: Fabric Resource Loader (v1) 2.0.13+9edec1269e
fabric-screen-api-v1: Fabric Screen API (v1) 5.2.1+5087f8249e
fabric-serialization-api-v1: Fabric Serialization API (v1) 2.0.4+11a26f319e
fabric-sound-api-v1: Fabric Sound API (v1) 2.0.5+11a26f319e
fabric-tag-api-v1: Fabric Tag API (v1) 2.1.4+515ac5339e
fabric-transfer-api-v1: Fabric Transfer API (v1) 8.0.13+11dbb7d79e
fabric-transitive-access-wideners-v1: Fabric Transitive Access Wideners (v1) 8.1.4+67c847259e
fabricloader: Fabric Loader 0.19.5
io_github_givimad_whisper-jni: whisper-jni 1.7.1
java: OpenJDK 64-Bit Server VM 25
minecraft: Minecraft 26.2
mixinextras: MixinExtras 0.5.5
org_jcodec_jcodec: jcodec 0.2.5
org_luaj_luaj-jse: luaj-jse 3.0.1
viafabricplus: ViaFabricPlus 5.0.2
com_seedfinding_mc_biome: mc_biome 1.171.1
com_seedfinding_mc_core: mc_core 1.210.0
com_seedfinding_mc_math: mc_math 1.171.0
com_seedfinding_mc_noise: mc_noise 1.171.1
com_seedfinding_mc_seed: mc_seed 1.171.2
com_viaversion_viaaprilfools-common: viaaprilfools-common 4.2.3
com_viaversion_viabackwards-common: viabackwards-common 5.12.0
de_florianreuth_classic4j: classic4j 2.3.1
net_lenni0451_commons_unchecked: unchecked 1.9.2
net_lenni0451_reflect: Reflect 1.6.4
net_raphimc_vialegacy: ViaLegacy 3.1.0
viafabricplus-api: ViaFabricPlus API 5.0.2
voicechat: Simple Voice Chat 2.6.21+26.2
voicechat_api: Simple Voice Chat API 2.6.20
Launched Version: Fabric
Backend library: LWJGL version 3.4.1-snapshot
Window size: <not initialized>
Surface Info: <no surface>
GFLW Platform: x11
Graphics Device: AMD Radeon RX 470 Graphics (radeonsi, polaris10, ACO, DRM 3.64, 7.2.7-arch1-1)
Graphics Backend: OpenGL
Graphics Vendor: AMD
Graphics Drivers: 4.6 (Core Profile) Mesa 26.2.3-arch1.1
Graphics Device Extensions: GL_ARB_multi_draw_indirect, GL_ARB_buffer_storage, GL_ARB_shader_draw_parameters, GL_ARB_base_instance, GL_KHR_debug, GL_ARB_draw_indirect, GL_ARB_clip_control, GL_ARB_vertex_attrib_binding, GL_ARB_direct_state_access, GL_EXT_texture_filter_anisotropic
Graphics Device Type: OTHER
Graphics Device Features: DeviceFeatures[shaderDrawParameters=true, multiDrawDirectInterleaved=false, multiDrawDirectSeparate=true, multiDrawIndirect=true, drawIndirect=true, nonZeroFirstInstance=true, persistentMapping=true]
GL debug messages:
Is Modded: Definitely; Client brand changed to 'fabric'
Universe: 404
Type: Client
Locale: ru_RU
System encoding: UTF-8
File encoding: UTF-8
CPU: 24x Intel(R) Xeon(R) CPU E5-2680 v3 @ 2.50GHz
#@!@# Game crashed! Crash report saved to: #@!@# /storage/aboba/evovis-client/run/crash-reports/crash-2026-10-03_19.16.12-client.txt
> Task :runClient FAILED
[Incubating] Problems report is available at: file:///storage/aboba/evovis-client/build/reports/problems/problems-report.html
FAILURE: Build failed with an exception.
* What went wrong:
Execution failed for task ':runClient' (registered by plugin 'fabric-loom').
> Process 'command '/usr/lib/jvm/java-25-openjdk/bin/java'' finished with non-zero exit value 255
* Try:
> Run with --stacktrace option to get the stack trace.
> Run with --info or --debug option to get more log output.
> Run with --scan to get full insights from a Build Scan (powered by Develocity).
> Get more help at https://help.gradle.org.
BUILD FAILED in 2m 22s
7 actionable tasks: 6 executed, 1 up-to-date

335
build-logs/runclient2.log Normal file
View file

@ -0,0 +1,335 @@
> Configure project :
Fabric Loom: 1.17.12
> Task :compileJava UP-TO-DATE
> Task :processResources UP-TO-DATE
> Task :classes UP-TO-DATE
> Task :generateLog4jConfig UP-TO-DATE
> Task :generateDLIConfig UP-TO-DATE
> Task :configureLaunch UP-TO-DATE
> Task :downloadAssets UP-TO-DATE
> Task :configureClientLaunch UP-TO-DATE
> Task :postprocessClasses
postbuild: moved=1311 rewritten=105 (/storage/aboba/evovis-client/build/classes/java/main)
> Task :runClient
[20:15:00] [main/INFO] (FabricLoader/GameProvider) Loading Minecraft 26.2 with Fabric Loader 0.19.5
[20:15:00] [main/INFO] (FabricLoader/Mappings) Mappings not present!
[20:15:01] [main/INFO] (FabricLoader) Loading 72 mods:
- ai_djl_api 0.32.0
- ai_djl_pytorch_pytorch-engine 0.32.0
- com_viaversion_viaversion-common 5.12.0
- evolutiondlc 2026.10.1.994
- fabric-api 0.159.0+26.2
- fabric-api-base 2.0.4+ece063239e
- fabric-api-lookup-api-v1 2.0.18+11e1c9a39e
- fabric-biome-api-v1 18.0.6+c7bd5b8e9e
- fabric-block-api-v1 3.0.3+ec56b6019e
- fabric-block-getter-api-v2 2.0.7+ec56b6019e
- fabric-client-gametest-api-v1 6.0.1+0f4f1dca9e
- fabric-command-api-v2 3.1.0+00cb03469e
- fabric-content-registries-v0 11.3.2+37b1aa249e
- fabric-convention-tags-v2 4.7.1+1f023a9e9e
- fabric-crash-report-info-v1 1.0.5+086d547a9e
- fabric-creative-tab-api-v1 5.0.14+d871b99e9e
- fabric-data-attachment-api-v1 2.2.18+515ac5339e
- fabric-data-generation-api-v1 25.5.1+aed122aa9e
- fabric-debug-api-v1 1.0.2+c792624d9e
- fabric-dimensions-v1 5.1.12+515ac5339e
- fabric-entity-events-v1 5.0.5+06488ac19e
- fabric-events-interaction-v0 5.2.7+515ac5339e
- fabric-game-rule-api-v1 4.0.8+46a6d00c9e
- fabric-gametest-api-v1 4.0.21+4a7fa0819e
- fabric-item-api-v1 14.5.0+c68f6cbe9e
- fabric-key-mapping-api-v1 2.0.5+e2bdee789e
- fabric-lifecycle-events-v1 4.1.4+29b6eb019e
- fabric-loot-api-v3 3.0.17+06488ac19e
- fabric-menu-api-v1 2.0.16+086d547a9e
- fabric-message-api-v1 7.0.8+bb2ed3f79e
- fabric-model-loading-api-v1 8.0.17+c80601bb9e
- fabric-networking-api-v1 6.3.3+72073ef09e
- fabric-object-builder-api-v1 24.1.0+6fcd5f039e
- fabric-particles-v1 5.0.18+d1756aa99e
- fabric-permission-api-v1 1.0.5+e442d8d09e
- fabric-recipe-api-v1 9.0.21+11e1c9a39e
- fabric-registry-sync-v0 7.1.0+c7bd5b8e9e
- fabric-renderer-api-v1 14.1.4+2b0d8a229e
- fabric-renderer-indigo 9.1.4+2b0d8a229e
- fabric-rendering-fluids-v1 6.0.4+06488ac19e
- fabric-rendering-v1 25.3.3+515ac5339e
- fabric-resource-conditions-api-v1 6.1.0+10e9a28b9e
- fabric-resource-loader-v0 3.3.20+4fc5413f9e
- fabric-resource-loader-v1 2.0.13+9edec1269e
- fabric-screen-api-v1 5.2.1+5087f8249e
- fabric-serialization-api-v1 2.0.4+11a26f319e
- fabric-sound-api-v1 2.0.5+11a26f319e
- fabric-tag-api-v1 2.1.4+515ac5339e
- fabric-transfer-api-v1 8.0.13+11dbb7d79e
- fabric-transitive-access-wideners-v1 8.1.4+67c847259e
- fabricloader 0.19.5
- io_github_givimad_whisper-jni 1.7.1
- java 25
- minecraft 26.2
- mixinextras 0.5.5
- org_jcodec_jcodec 0.2.5
- org_luaj_luaj-jse 3.0.1
- viafabricplus 5.0.2
|-- com_seedfinding_mc_biome 1.171.1
|-- com_seedfinding_mc_core 1.210.0
|-- com_seedfinding_mc_math 1.171.0
|-- com_seedfinding_mc_noise 1.171.1
|-- com_seedfinding_mc_seed 1.171.2
|-- com_viaversion_viaaprilfools-common 4.2.3
|-- com_viaversion_viabackwards-common 5.12.0
|-- de_florianreuth_classic4j 2.3.1
|-- net_lenni0451_commons_unchecked 1.9.2
|-- net_lenni0451_reflect 1.6.4
\-- net_raphimc_vialegacy 3.1.0
- viafabricplus-api 5.0.2
- voicechat 2.6.21+26.2
\-- voicechat_api 2.6.20
[20:15:01] [main/INFO] (FabricLoader/Mixin) SpongePowered MIXIN Subsystem Version=0.8.7 Source=file:/storage/gradle/caches/modules-2/files-2.1/net.fabricmc/sponge-mixin/0.17.4+mixin.0.8.7/5f66cc9f59b8efaa942155a3d5a30599bf6640dd/sponge-mixin-0.17.4+mixin.0.8.7.jar Service=Knot/Fabric Env=CLIENT
[20:15:02] [main/WARN] (FabricLoader/Mixin) Error loading class: net/caffeinemc/mods/sodium/client/model/light/data/LightDataAccess (java.lang.ClassNotFoundException: net/caffeinemc/mods/sodium/client/model/light/data/LightDataAccess)
[20:15:02] [main/WARN] (FabricLoader/Mixin) Error loading class: net/caffeinemc/mods/sodium/client/render/chunk/compile/pipeline/BlockRenderer (java.lang.ClassNotFoundException: net/caffeinemc/mods/sodium/client/render/chunk/compile/pipeline/BlockRenderer)
[20:15:02] [main/WARN] (FabricLoader/Mixin) Error loading class: net/caffeinemc/mods/sodium/client/render/model/AbstractBlockRenderContext (java.lang.ClassNotFoundException: net/caffeinemc/mods/sodium/client/render/model/AbstractBlockRenderContext)
[20:15:02] [main/WARN] (FabricLoader/Mixin) Error loading class: com/replaymod/replaystudio/protocol/packets/PacketTeam (java.lang.ClassNotFoundException: com/replaymod/replaystudio/protocol/packets/PacketTeam)
[20:15:02] [main/WARN] (FabricLoader/Mixin) Error loading class: com/replaymod/replaystudio/lib/viaversion/api/data/MappingDataLoader (java.lang.ClassNotFoundException: com/replaymod/replaystudio/lib/viaversion/api/data/MappingDataLoader)
[20:15:02] [main/WARN] (FabricLoader/Mixin) Error loading class: com/replaymod/replaystudio/lib/viaversion/protocols/v1_12_2to1_13/data/MappingData1_13 (java.lang.ClassNotFoundException: com/replaymod/replaystudio/lib/viaversion/protocols/v1_12_2to1_13/data/MappingData1_13)
[20:15:02] [main/WARN] (FabricLoader/Mixin) Error loading class: com/replaymod/replaystudio/lib/viaversion/protocols/v1_12_2to1_13/data/RecipeData (java.lang.ClassNotFoundException: com/replaymod/replaystudio/lib/viaversion/protocols/v1_12_2to1_13/data/RecipeData)
[20:15:02] [main/WARN] (FabricLoader/Mixin) Error loading class: com/replaymod/replaystudio/lib/viaversion/protocols/v1_12_2to1_13/data/BlockIdData (java.lang.ClassNotFoundException: com/replaymod/replaystudio/lib/viaversion/protocols/v1_12_2to1_13/data/BlockIdData)
[20:15:05] [main/INFO] (FabricLoader/MixinExtras|Service) Initializing MixinExtras via com.llamalad7.mixinextras.service.MixinExtrasServiceImpl(version=0.5.5).
[20:15:07] [Via-Mappingloader-1/INFO] (ViaVersion) Loading block connection mappings ...
[20:15:07] [Worker-Main-1/INFO] (ViaBackwards) Loading translations...
[20:15:07] [Worker-Main-1/INFO] (ViaBackwards) Registering protocols...
[20:15:08] [Worker-Main-1/INFO] (ViaVersion) ViaVersion detected lowest supported version by the proxy: c0.0.15a-1 (0)
[20:15:08] [Worker-Main-1/INFO] (ViaVersion) Highest supported version by the proxy: 26.3 (777)
[20:15:08] [Worker-Main-1/INFO] (Minecraft) Environment: Environment[sessionHost=https://sessionserver.mojang.com, servicesHost=https://api.minecraftservices.com, profilesHost=https://api.mojang.com, name=PROD]
[20:15:09] [Datafixer Bootstrap #0/INFO] (Minecraft) 295 Datafixer optimizations took 1066 milliseconds
[20:15:09] [Via Async Scheduler 0/INFO] (ViaVersion) Finished mapping loading, shutting down loader executor.
[20:15:17] [Render thread/INFO] (Minecraft) Environment: Environment[sessionHost=https://sessionserver.mojang.com, servicesHost=https://api.minecraftservices.com, profilesHost=https://api.mojang.com, name=PROD]
[20:15:17] [Render thread/INFO] (Minecraft) Setting user: Player74
[20:15:17] [Render thread/INFO] (Minecraft) [STDOUT]: Using parent class loader: net.fabricmc.loader.impl.launch.knot.KnotClassLoader@13a5fe33
[20:15:18] [Render thread/INFO] (holdmyitems) What you staring at?
[20:15:18] [Render thread/WARN] (voicechat) [voicechat/Voicechat] Running in debug mode - Don't leave this enabled in production!
[20:15:18] [Render thread/INFO] (voicechat) [voicechat/Voicechat] Compatibility version 20
[20:15:18] [Render thread/INFO] (voicechat) [voicechat/PluginManager] Loading plugins
[20:15:18] [Render thread/INFO] (voicechat) [voicechat/PluginManager] Loaded 1 plugin(s)
[20:15:18] [Render thread/INFO] (voicechat) [voicechat/PluginManager] Initializing plugins
[20:15:18] [Render thread/INFO] (voicechat) [voicechat/PluginManager] Initialized 1 plugin(s)
[20:15:18] [Render thread/INFO] (voicechat) [voicechat/PluginManager] Registering events for 'evolutiondlc'
[20:15:18] [Render thread/INFO] (voicechat) [voicechat/ViaVersionCompatibility] Successfully registered ViaVersion mappings
[20:15:19] [Render thread/INFO] (Indigo) [Indigo] Registering Indigo renderer!
[20:15:19] [Render thread/INFO] (voicechat) [voicechat/NativeValidator] Initializing Opus
[20:15:19] [Render thread/INFO] (voicechat) [voicechat/NativeValidator] Successfully initialized Opus
[20:15:19] [Render thread/INFO] (voicechat) [voicechat/NativeValidator] Initializing RNNoise
[20:15:19] [Render thread/INFO] (voicechat) [voicechat/NativeValidator] Successfully initialized RNNoise
[20:15:19] [Render thread/INFO] (voicechat) [voicechat/NativeValidator] Initializing Speex
[20:15:20] [Render thread/INFO] (voicechat) [voicechat/NativeValidator] Successfully initialized Speex
[20:15:20] [Render thread/INFO] (voicechat) [voicechat/NativeValidator] Initializing LAME
[20:15:20] [Render thread/INFO] (voicechat) [voicechat/NativeValidator] Successfully initialized LAME
[20:15:20] [Render thread/INFO] (Minecraft) Backend library: LWJGL version 3.4.1-snapshot
[20:15:20] [Render thread/WARN] (Minecraft) Detected unexpected shutdown during last game startup: resetting fullscreen mode
[20:15:20] [Render thread/WARN] (Minecraft) Detected unexpected shutdown during last game startup: forcing preferred graphics API to OpenGL
[20:15:21] [Render thread/INFO] (Minecraft) Using graphics backend OpenGL, using drivers: 4.6 (Core Profile) Mesa 26.2.3-arch1.1
[20:15:21] [Render thread/INFO] (Minecraft) Using graphics device: AMD Radeon RX 470 Graphics (radeonsi, polaris10, ACO, DRM 3.64, 7.2.7-arch1-1) (AMD)
[20:15:21] [Render thread/INFO] (Minecraft) Using graphics device extensions: GL_ARB_multi_draw_indirect, GL_ARB_buffer_storage, GL_ARB_shader_draw_parameters, GL_ARB_base_instance, GL_KHR_debug, GL_ARB_draw_indirect, GL_ARB_clip_control, GL_ARB_vertex_attrib_binding, GL_ARB_direct_state_access, GL_EXT_texture_filter_anisotropic
---- Minecraft Crash Report ----
// There are four lights!
Time: 2026-10-03 20:15:22
Description: Initializing game
java.lang.ExceptionInInitializerError
at knot//lc.registerRender(lc.java:124)
at knot//lc.init(lc.java:65)
at knot//lc.<init>(lc.java:13)
at knot//bz.init(bz.java:66)
at knot//net.minecraft.client.Minecraft.handler$zbm000$evolutiondlc$init(Minecraft.java:3656)
at knot//net.minecraft.client.Minecraft.<init>(Minecraft.java:553)
at knot//net.minecraft.client.main.Main.main(Main.java:278)
at net.fabricmc.loader.impl.game.minecraft.MinecraftGameProvider.launch(MinecraftGameProvider.java:517)
at net.fabricmc.loader.impl.launch.knot.Knot.launch(Knot.java:72)
at net.fabricmc.loader.impl.launch.knot.KnotClient.main(KnotClient.java:23)
at net.fabricmc.devlaunchinjector.Main.main(Main.java:86)
Caused by: java.lang.ArrayIndexOutOfBoundsException: Index 12 out of bounds for length 12
at knot//ux.buildUnitCircles(ux.java:146)
at knot//ux.<clinit>(ux.java:24)
... 11 more
A detailed walkthrough of the error, its code path and all known details is as follows:
---------------------------------------------------------------------------------------
-- Head --
Thread: Render thread
Stacktrace:
at knot//lc.registerRender(lc.java:124)
at knot//lc.init(lc.java:65)
at knot//lc.<init>(lc.java:13)
at knot//bz.init(bz.java:66)
at knot//net.minecraft.client.Minecraft.handler$zbm000$evolutiondlc$init(Minecraft.java:3656)
at knot//net.minecraft.client.Minecraft.<init>(Minecraft.java:553)
-- Initialization --
Details:
Modules:
Stacktrace:
at knot//net.minecraft.client.main.Main.main(Main.java:278)
at net.fabricmc.loader.impl.game.minecraft.MinecraftGameProvider.launch(MinecraftGameProvider.java:517)
at net.fabricmc.loader.impl.launch.knot.Knot.launch(Knot.java:72)
at net.fabricmc.loader.impl.launch.knot.KnotClient.main(KnotClient.java:23)
at net.fabricmc.devlaunchinjector.Main.main(Main.java:86)
-- System Details --
Details:
Minecraft Version: 26.2
Minecraft Version ID: 26.2
Operating System: Linux (amd64) version 7.2.7-arch1-1
Java Version: 25.0.4.1, Arch Linux
Java VM Version: OpenJDK 64-Bit Server VM (mixed mode, sharing), Arch Linux
Memory: 198941968 bytes (189 MiB) / 499122176 bytes (476 MiB) up to 4148166656 bytes (3956 MiB)
Memory (heap): init: 248MiB, used: 283MiB, committed: 476MiB, max: 3956MiB
Memory (non-head): init: 007MiB, used: 165MiB, committed: 167MiB, max: 000MiB
CPUs: 24
Processor Vendor: GenuineIntel
Processor Name: Intel(R) Xeon(R) CPU E5-2680 v3 @ 2.50GHz
Identifier: Intel64 Family 6 Model 63 Stepping 2
Microarchitecture: Haswell (Server)
Frequency (GHz): 2.50
Number of physical packages: 1
Number of physical CPUs: 12
Number of logical CPUs: 24
Graphics card #0 name: Ellesmere [Radeon RX 470/480/570/570X/580/580X/590]
Graphics card #0 vendor: Advanced Micro Devices, Inc. [AMD/ATI] (0x1002)
Graphics card #0 VRAM (MiB): 258.00
Graphics card #0 deviceId: 0x67df
Graphics card #0 versionInfo: unknown
Virtual memory max (MiB): 16100.76
Virtual memory used (MiB): 19395.29
Swap memory total (MiB): 8192.00
Swap memory used (MiB): 5413.84
Space in storage for jna.tmpdir (MiB): <path not set>
Space in storage for org.lwjgl.system.SharedLibraryExtractPath (MiB): <path not set>
Space in storage for io.netty.native.workdir (MiB): <path not set>
Space in storage for java.io.tmpdir (MiB): available: 7678.44, total: 7908.77
Space in storage for workdir (MiB): available: 693271.31, total: 953868.69
Operating System Version: GNU/Linux Arch Linux unknown (unknown) build 7.2.7-arch1-1
Process Elevated: false
Process Loads: Uptime: 23s, user: 57s (244.63%), kernel: 2s (9.64%), total: 59s (254.27%)
Process Virtual Size (MiB): 7615.27
Process Resident Size (MiB): 847.98
JVM Flags: 0 total;
Debug Flags: 0 total;
Fabric Mods:
ai_djl_api: api 0.32.0
ai_djl_pytorch_pytorch-engine: pytorch-engine 0.32.0
com_viaversion_viaversion-common: viaversion-common 5.12.0
evolutiondlc: EvolutionDLC 2026.10.1.994
fabric-api: Fabric API 0.159.0+26.2
fabric-api-base: Fabric API Base 2.0.4+ece063239e
fabric-api-lookup-api-v1: Fabric API Lookup API (v1) 2.0.18+11e1c9a39e
fabric-biome-api-v1: Fabric Biome API (v1) 18.0.6+c7bd5b8e9e
fabric-block-api-v1: Fabric Block API (v1) 3.0.3+ec56b6019e
fabric-block-getter-api-v2: Fabric BlockGetter API (v2) 2.0.7+ec56b6019e
fabric-client-gametest-api-v1: Fabric Client Game Test API (v1) 6.0.1+0f4f1dca9e
fabric-command-api-v2: Fabric Command API (v2) 3.1.0+00cb03469e
fabric-content-registries-v0: Fabric Content Registries (v0) 11.3.2+37b1aa249e
fabric-convention-tags-v2: Fabric Convention Tags (v2) 4.7.1+1f023a9e9e
fabric-crash-report-info-v1: Fabric Crash Report Info (v1) 1.0.5+086d547a9e
fabric-creative-tab-api-v1: Fabric Creative Tab API (v1) 5.0.14+d871b99e9e
fabric-data-attachment-api-v1: Fabric Data Attachment API (v1) 2.2.18+515ac5339e
fabric-data-generation-api-v1: Fabric Data Generation API (v1) 25.5.1+aed122aa9e
fabric-debug-api-v1: Fabric Debug API (v1) 1.0.2+c792624d9e
fabric-dimensions-v1: Fabric Dimensions API (v1) 5.1.12+515ac5339e
fabric-entity-events-v1: Fabric Entity Events (v1) 5.0.5+06488ac19e
fabric-events-interaction-v0: Fabric Events Interaction (v0) 5.2.7+515ac5339e
fabric-game-rule-api-v1: Fabric Game Rule API (v1) 4.0.8+46a6d00c9e
fabric-gametest-api-v1: Fabric Game Test API (v1) 4.0.21+4a7fa0819e
fabric-item-api-v1: Fabric Item API (v1) 14.5.0+c68f6cbe9e
fabric-key-mapping-api-v1: Fabric Key Mapping API (v1) 2.0.5+e2bdee789e
fabric-lifecycle-events-v1: Fabric Lifecycle Events (v1) 4.1.4+29b6eb019e
fabric-loot-api-v3: Fabric Loot API (v3) 3.0.17+06488ac19e
fabric-menu-api-v1: Fabric Menu API (v1) 2.0.16+086d547a9e
fabric-message-api-v1: Fabric Message API (v1) 7.0.8+bb2ed3f79e
fabric-model-loading-api-v1: Fabric Model Loading API (v1) 8.0.17+c80601bb9e
fabric-networking-api-v1: Fabric Networking API (v1) 6.3.3+72073ef09e
fabric-object-builder-api-v1: Fabric Object Builder API (v1) 24.1.0+6fcd5f039e
fabric-particles-v1: Fabric Particles (v1) 5.0.18+d1756aa99e
fabric-permission-api-v1: Fabric Permission API (v1) 1.0.5+e442d8d09e
fabric-recipe-api-v1: Fabric Recipe API (v1) 9.0.21+11e1c9a39e
fabric-registry-sync-v0: Fabric Registry Sync (v0) 7.1.0+c7bd5b8e9e
fabric-renderer-api-v1: Fabric Renderer API (v1) 14.1.4+2b0d8a229e
fabric-renderer-indigo: Fabric Renderer - Indigo 9.1.4+2b0d8a229e
fabric-rendering-fluids-v1: Fabric Rendering Fluids (v1) 6.0.4+06488ac19e
fabric-rendering-v1: Fabric Rendering (v1) 25.3.3+515ac5339e
fabric-resource-conditions-api-v1: Fabric Resource Conditions API (v1) 6.1.0+10e9a28b9e
fabric-resource-loader-v0: Fabric Resource Loader (v0) 3.3.20+4fc5413f9e
fabric-resource-loader-v1: Fabric Resource Loader (v1) 2.0.13+9edec1269e
fabric-screen-api-v1: Fabric Screen API (v1) 5.2.1+5087f8249e
fabric-serialization-api-v1: Fabric Serialization API (v1) 2.0.4+11a26f319e
fabric-sound-api-v1: Fabric Sound API (v1) 2.0.5+11a26f319e
fabric-tag-api-v1: Fabric Tag API (v1) 2.1.4+515ac5339e
fabric-transfer-api-v1: Fabric Transfer API (v1) 8.0.13+11dbb7d79e
fabric-transitive-access-wideners-v1: Fabric Transitive Access Wideners (v1) 8.1.4+67c847259e
fabricloader: Fabric Loader 0.19.5
io_github_givimad_whisper-jni: whisper-jni 1.7.1
java: OpenJDK 64-Bit Server VM 25
minecraft: Minecraft 26.2
mixinextras: MixinExtras 0.5.5
org_jcodec_jcodec: jcodec 0.2.5
org_luaj_luaj-jse: luaj-jse 3.0.1
viafabricplus: ViaFabricPlus 5.0.2
com_seedfinding_mc_biome: mc_biome 1.171.1
com_seedfinding_mc_core: mc_core 1.210.0
com_seedfinding_mc_math: mc_math 1.171.0
com_seedfinding_mc_noise: mc_noise 1.171.1
com_seedfinding_mc_seed: mc_seed 1.171.2
com_viaversion_viaaprilfools-common: viaaprilfools-common 4.2.3
com_viaversion_viabackwards-common: viabackwards-common 5.12.0
de_florianreuth_classic4j: classic4j 2.3.1
net_lenni0451_commons_unchecked: unchecked 1.9.2
net_lenni0451_reflect: Reflect 1.6.4
net_raphimc_vialegacy: ViaLegacy 3.1.0
viafabricplus-api: ViaFabricPlus API 5.0.2
voicechat: Simple Voice Chat 2.6.21+26.2
voicechat_api: Simple Voice Chat API 2.6.20
Launched Version: Fabric
Backend library: LWJGL version 3.4.1-snapshot
Window size: <not initialized>
Surface Info: <no surface>
GFLW Platform: x11
Graphics Device: AMD Radeon RX 470 Graphics (radeonsi, polaris10, ACO, DRM 3.64, 7.2.7-arch1-1)
Graphics Backend: OpenGL
Graphics Vendor: AMD
Graphics Drivers: 4.6 (Core Profile) Mesa 26.2.3-arch1.1
Graphics Device Extensions: GL_ARB_multi_draw_indirect, GL_ARB_buffer_storage, GL_ARB_shader_draw_parameters, GL_ARB_base_instance, GL_KHR_debug, GL_ARB_draw_indirect, GL_ARB_clip_control, GL_ARB_vertex_attrib_binding, GL_ARB_direct_state_access, GL_EXT_texture_filter_anisotropic
Graphics Device Type: OTHER
Graphics Device Features: DeviceFeatures[shaderDrawParameters=true, multiDrawDirectInterleaved=false, multiDrawDirectSeparate=true, multiDrawIndirect=true, drawIndirect=true, nonZeroFirstInstance=true, persistentMapping=true]
GL debug messages:
Is Modded: Definitely; Client brand changed to 'fabric'
Universe: 404
Type: Client
Locale: ru_RU
System encoding: UTF-8
File encoding: UTF-8
CPU: 24x Intel(R) Xeon(R) CPU E5-2680 v3 @ 2.50GHz
#@!@# Game crashed! Crash report saved to: #@!@# /storage/aboba/evovis-client/run/crash-reports/crash-2026-10-03_20.15.22-client.txt
> Task :runClient FAILED
FAILURE: Build failed with an exception.
* What went wrong:
Execution failed for task ':runClient' (registered by plugin 'fabric-loom').
> Process 'command '/usr/lib/jvm/java-25-openjdk/bin/java'' finished with non-zero exit value 255
* Try:
> Run with --stacktrace option to get the stack trace.
> Run with --info or --debug option to get more log output.
> Run with --scan to get full insights from a Build Scan (powered by Develocity).
> Get more help at https://help.gradle.org.
BUILD FAILED in 36s
7 actionable tasks: 2 executed, 5 up-to-date

1636
build-logs/runclient3.log Normal file

File diff suppressed because it is too large Load diff

1717
build-logs/runclient4.log Normal file

File diff suppressed because it is too large Load diff

1477
build-logs/runclient5.log Normal file

File diff suppressed because it is too large Load diff

39
build-logs/vfbuild48.log Normal file
View file

@ -0,0 +1,39 @@
/storage/aboba/evovis-client/src/main/java/defpackage/aod.java:729: error: local variables referenced from a lambda expression must be final or effectively final
daemon(() -> this.reap(var4, var5, var3, var6 != 0), "EvoWatchReaper-" + this.serial);
^
/storage/aboba/evovis-client/src/main/java/defpackage/aod.java:729: error: local variables referenced from a lambda expression must be final or effectively final
daemon(() -> this.reap(var4, var5, var3, var6 != 0), "EvoWatchReaper-" + this.serial);
^
/storage/aboba/evovis-client/src/main/java/defpackage/aod.java:729: error: local variables referenced from a lambda expression must be final or effectively final
daemon(() -> this.reap(var4, var5, var3, var6 != 0), "EvoWatchReaper-" + this.serial);
^
/storage/aboba/evovis-client/src/main/java/defpackage/aod.java:729: error: local variables referenced from a lambda expression must be final or effectively final
daemon(() -> this.reap(var4, var5, var3, var6 != 0), "EvoWatchReaper-" + this.serial);
^
/storage/aboba/evovis-client/src/main/java/defpackage/aod.java:763: error: local variables referenced from a lambda expression must be final or effectively final
var6.getTextureManager().release(this.textureId);
^
/storage/aboba/evovis-client/src/main/java/defpackage/aod.java:795: error: local variables referenced from a lambda expression must be final or effectively final
if (var5 == 0) {
^
Note: Some input files use or override a deprecated API.
Note: Recompile with -Xlint:deprecation for details.
Note: Some input files use unchecked or unsafe operations.
Note: Recompile with -Xlint:unchecked for details.
6 errors
FAILURE: Build failed with an exception.
* What went wrong:
Execution failed for task ':compileJava' (registered by plugin class 'org.gradle.api.plugins.JavaBasePlugin').
> Compilation failed; see the compiler output below.
/storage/aboba/evovis-client/src/main/java/defpackage/aod.java:729: error: local variables referenced from a lambda expression must be final or effectively final
daemon(() -> this.reap(var4, var5, var3, var6 != 0), "EvoWatchReaper-" + this.serial);
^
6 errors
* Try:
> Check your code and dependencies to fix the compilation error(s)
> Run with --scan to get full insights from a Build Scan (powered by Develocity).
BUILD FAILED in 13s

27
build-logs/vfbuild49.log Normal file
View file

@ -0,0 +1,27 @@
/storage/aboba/evovis-client/src/main/java/defpackage/aoh.java:518: error: local variables referenced from a lambda expression must be final or effectively final
if (var1 - var2.hiddenAt > (7695969247871140036L ^ -7695969247871139816L) + ((7695969247871140036L & -7695969247871139816L) << 1)) {
^
/storage/aboba/evovis-client/src/main/java/defpackage/aoh.java:547: error: local variables referenced from a lambda expression must be final or effectively final
if (var1 - var2.receivedAt > (-5039970975211645647L | 5039970975211651647L) + (-5039970975211645647L & 5039970975211651647L)) {
^
Note: Some input files use or override a deprecated API.
Note: Recompile with -Xlint:deprecation for details.
Note: Some input files use unchecked or unsafe operations.
Note: Recompile with -Xlint:unchecked for details.
2 errors
FAILURE: Build failed with an exception.
* What went wrong:
Execution failed for task ':compileJava' (registered by plugin class 'org.gradle.api.plugins.JavaBasePlugin').
> Compilation failed; see the compiler output below.
/storage/aboba/evovis-client/src/main/java/defpackage/aoh.java:518: error: local variables referenced from a lambda expression must be final or effectively final
if (var1 - var2.hiddenAt > (7695969247871140036L ^ -7695969247871139816L) + ((7695969247871140036L & -7695969247871139816L) << 1)) {
^
2 errors
* Try:
> Check your code and dependencies to fix the compilation error(s)
> Run with --scan to get full insights from a Build Scan (powered by Develocity).
BUILD FAILED in 15s

27
build-logs/vfbuild50.log Normal file
View file

@ -0,0 +1,27 @@
/storage/aboba/evovis-client/src/main/java/defpackage/aox.java:342: error: local variables referenced from a lambda expression must be final or effectively final
SPEAKERS_BY_ID.values().removeIf(var2x -> isEvictable(var2x, var0));
^
/storage/aboba/evovis-client/src/main/java/defpackage/aox.java:343: error: local variables referenced from a lambda expression must be final or effectively final
SPEAKERS.removeIf(var2x -> isEvictable(var2x, var0));
^
Note: Some input files use or override a deprecated API.
Note: Recompile with -Xlint:deprecation for details.
Note: Some input files use unchecked or unsafe operations.
Note: Recompile with -Xlint:unchecked for details.
2 errors
FAILURE: Build failed with an exception.
* What went wrong:
Execution failed for task ':compileJava' (registered by plugin class 'org.gradle.api.plugins.JavaBasePlugin').
> Compilation failed; see the compiler output below.
/storage/aboba/evovis-client/src/main/java/defpackage/aox.java:342: error: local variables referenced from a lambda expression must be final or effectively final
SPEAKERS_BY_ID.values().removeIf(var2x -> isEvictable(var2x, var0));
^
2 errors
* Try:
> Check your code and dependencies to fix the compilation error(s)
> Run with --scan to get full insights from a Build Scan (powered by Develocity).
BUILD FAILED in 14s

24
build-logs/vfbuild51.log Normal file
View file

@ -0,0 +1,24 @@
/storage/aboba/evovis-client/src/main/java/defpackage/aoz.java:78: error: unreported exception NoSuchAlgorithmException; must be caught or declared to be thrown
throw var13;
^
Note: Some input files use or override a deprecated API.
Note: Recompile with -Xlint:deprecation for details.
Note: Some input files use unchecked or unsafe operations.
Note: Recompile with -Xlint:unchecked for details.
1 error
FAILURE: Build failed with an exception.
* What went wrong:
Execution failed for task ':compileJava' (registered by plugin class 'org.gradle.api.plugins.JavaBasePlugin').
> Compilation failed; see the compiler output below.
/storage/aboba/evovis-client/src/main/java/defpackage/aoz.java:78: error: unreported exception NoSuchAlgorithmException; must be caught or declared to be thrown
throw var13;
^
1 error
* Try:
> Check your code and dependencies to fix the compilation error(s)
> Run with --scan to get full insights from a Build Scan (powered by Develocity).
BUILD FAILED in 8s

129
build-logs/vfbuild52.log Normal file
View file

@ -0,0 +1,129 @@
/storage/aboba/evovis-client/src/main/java/defpackage/aph.java:66: error: local variables referenced from a lambda expression must be final or effectively final
var3.append(Component.literal(var4.toString()).setStyle(var5[0]));
^
/storage/aboba/evovis-client/src/main/java/defpackage/aph.java:66: error: local variables referenced from a lambda expression must be final or effectively final
var3.append(Component.literal(var4.toString()).setStyle(var5[0]));
^
/storage/aboba/evovis-client/src/main/java/defpackage/aph.java:66: error: local variables referenced from a lambda expression must be final or effectively final
var3.append(Component.literal(var4.toString()).setStyle(var5[0]));
^
/storage/aboba/evovis-client/src/main/java/defpackage/aph.java:67: error: local variables referenced from a lambda expression must be final or effectively final
var4.setLength((-674859503 ^ 674859503) + ((-674859503 & 674859503) << 1));
^
/storage/aboba/evovis-client/src/main/java/defpackage/aph.java:71: error: local variables referenced from a lambda expression must be final or effectively final
if (!var6x.equals(var5[0])) {
^
/storage/aboba/evovis-client/src/main/java/defpackage/aph.java:78: error: local variables referenced from a lambda expression must be final or effectively final
var6[0] = var6[0]
^
/storage/aboba/evovis-client/src/main/java/defpackage/aph.java:78: error: local variables referenced from a lambda expression must be final or effectively final
var6[0] = var6[0]
^
/storage/aboba/evovis-client/src/main/java/defpackage/aph.java:85: error: local variables referenced from a lambda expression must be final or effectively final
var5[0] = var6x;
^
/storage/aboba/evovis-client/src/main/java/defpackage/aph.java:90: error: local variables referenced from a lambda expression must be final or effectively final
if (var6[0]
^
/storage/aboba/evovis-client/src/main/java/defpackage/aph.java:98: error: local variables referenced from a lambda expression must be final or effectively final
var4.appendCodePoint(var7x);
^
/storage/aboba/evovis-client/src/main/java/defpackage/aph.java:106: error: local variables referenced from a lambda expression must be final or effectively final
var7[0] = (boolean)(((1)) != 0);
^
/storage/aboba/evovis-client/src/main/java/defpackage/aph.java:109: error: local variables referenced from a lambda expression must be final or effectively final
if (!var4.isEmpty()) {
^
/storage/aboba/evovis-client/src/main/java/defpackage/aph.java:186: error: local variables referenced from a lambda expression must be final or effectively final
var6.appendCodePoint(var8x);
^
/storage/aboba/evovis-client/src/main/java/defpackage/aph.java:187: error: local variables referenced from a lambda expression must be final or effectively final
var8[0] = var8[0]
^
/storage/aboba/evovis-client/src/main/java/defpackage/aph.java:187: error: local variables referenced from a lambda expression must be final or effectively final
var8[0] = var8[0]
^
/storage/aboba/evovis-client/src/main/java/defpackage/aph.java:191: error: local variables referenced from a lambda expression must be final or effectively final
if (!var7[0].equals(var7x)) {
^
/storage/aboba/evovis-client/src/main/java/defpackage/aph.java:199: error: local variables referenced from a lambda expression must be final or effectively final
if (var8[0] == var4) {
^
/storage/aboba/evovis-client/src/main/java/defpackage/aph.java:199: error: local variables referenced from a lambda expression must be final or effectively final
if (var8[0] == var4) {
^
/storage/aboba/evovis-client/src/main/java/defpackage/aph.java:214: error: local variables referenced from a lambda expression must be final or effectively final
flushRun(var5, var6, var7[0]);
^
/storage/aboba/evovis-client/src/main/java/defpackage/aph.java:214: error: local variables referenced from a lambda expression must be final or effectively final
flushRun(var5, var6, var7[0]);
^
/storage/aboba/evovis-client/src/main/java/defpackage/aph.java:214: error: local variables referenced from a lambda expression must be final or effectively final
flushRun(var5, var6, var7[0]);
^
/storage/aboba/evovis-client/src/main/java/defpackage/aph.java:215: error: local variables referenced from a lambda expression must be final or effectively final
var7[0] = var7x;
^
/storage/aboba/evovis-client/src/main/java/defpackage/aph.java:227: error: local variables referenced from a lambda expression must be final or effectively final
if (var7[0] != null) {
^
/storage/aboba/evovis-client/src/main/java/defpackage/aph.java:247: error: local variables referenced from a lambda expression must be final or effectively final
var3[0] = var3[0]
^
/storage/aboba/evovis-client/src/main/java/defpackage/aph.java:247: error: local variables referenced from a lambda expression must be final or effectively final
var3[0] = var3[0]
^
/storage/aboba/evovis-client/src/main/java/defpackage/aph.java:356: error: local variables referenced from a lambda expression must be final or effectively final
var5.append(var9x);
^
/storage/aboba/evovis-client/src/main/java/defpackage/aph.java:359: error: local variables referenced from a lambda expression must be final or effectively final
if (var5.length() > 0) {
^
/storage/aboba/evovis-client/src/main/java/defpackage/aph.java:366: error: local variables referenced from a lambda expression must be final or effectively final
var7.append(var9x);
^
/storage/aboba/evovis-client/src/main/java/defpackage/aph.java:367: error: local variables referenced from a lambda expression must be final or effectively final
if (!var7x.equals(var6[0])) {
^
/storage/aboba/evovis-client/src/main/java/defpackage/aph.java:376: error: local variables referenced from a lambda expression must be final or effectively final
if (var7.toString().contains(var1)) {
^
/storage/aboba/evovis-client/src/main/java/defpackage/aph.java:383: error: local variables referenced from a lambda expression must be final or effectively final
var6[0] = var7x;
^
/storage/aboba/evovis-client/src/main/java/defpackage/aph.java:387: error: local variables referenced from a lambda expression must be final or effectively final
var4.append(Component.literal(var5.toString()).setStyle(var6[0]));
^
/storage/aboba/evovis-client/src/main/java/defpackage/aph.java:387: error: local variables referenced from a lambda expression must be final or effectively final
var4.append(Component.literal(var5.toString()).setStyle(var6[0]));
^
/storage/aboba/evovis-client/src/main/java/defpackage/aph.java:387: error: local variables referenced from a lambda expression must be final or effectively final
var4.append(Component.literal(var5.toString()).setStyle(var6[0]));
^
/storage/aboba/evovis-client/src/main/java/defpackage/aph.java:388: error: local variables referenced from a lambda expression must be final or effectively final
var5.setLength((2147089639 ^ -2147089639) + ((2147089639 & -2147089639) << 1));
^
/storage/aboba/evovis-client/src/main/java/defpackage/aph.java:392: error: local variables referenced from a lambda expression must be final or effectively final
var8[0] = (boolean)(((1)) != 0);
^
Note: Some input files use or override a deprecated API.
Note: Recompile with -Xlint:deprecation for details.
Note: Some input files use unchecked or unsafe operations.
Note: Recompile with -Xlint:unchecked for details.
36 errors
FAILURE: Build failed with an exception.
* What went wrong:
Execution failed for task ':compileJava' (registered by plugin class 'org.gradle.api.plugins.JavaBasePlugin').
> Compilation failed; see the compiler output below.
/storage/aboba/evovis-client/src/main/java/defpackage/aph.java:66: error: local variables referenced from a lambda expression must be final or effectively final
var3.append(Component.literal(var4.toString()).setStyle(var5[0]));
^
36 errors
* Try:
> Check your code and dependencies to fix the compilation error(s)
> Run with --scan to get full insights from a Build Scan (powered by Develocity).
BUILD FAILED in 14s

30
build-logs/vfbuild53.log Normal file
View file

@ -0,0 +1,30 @@
/storage/aboba/evovis-client/src/main/java/defpackage/apq.java:344: error: local variables referenced from a lambda expression must be final or effectively final
.filter(var1x -> ((MobEffect)var1x.getEffect().value()).getCategory().equals(var4))
^
/storage/aboba/evovis-client/src/main/java/defpackage/apq.java:536: error: local variables referenced from a lambda expression must be final or effectively final
app.addTask(() -> swapAndUse(var3, var1));
^
/storage/aboba/evovis-client/src/main/java/defpackage/apq.java:666: error: local variables referenced from a lambda expression must be final or effectively final
app.addTask(() -> clickSlot(var1, var0 - var4, ContainerInput.SWAP, (boolean)((((-1126116924 ^ 1126116924) + ((-1126116924 & 1126116924) << 1))) != 0)));
^
Note: Some input files use or override a deprecated API.
Note: Recompile with -Xlint:deprecation for details.
Note: Some input files use unchecked or unsafe operations.
Note: Recompile with -Xlint:unchecked for details.
3 errors
FAILURE: Build failed with an exception.
* What went wrong:
Execution failed for task ':compileJava' (registered by plugin class 'org.gradle.api.plugins.JavaBasePlugin').
> Compilation failed; see the compiler output below.
/storage/aboba/evovis-client/src/main/java/defpackage/apq.java:344: error: local variables referenced from a lambda expression must be final or effectively final
.filter(var1x -> ((MobEffect)var1x.getEffect().value()).getCategory().equals(var4))
^
3 errors
* Try:
> Check your code and dependencies to fix the compilation error(s)
> Run with --scan to get full insights from a Build Scan (powered by Develocity).
BUILD FAILED in 14s

30
build-logs/vfbuild54.log Normal file
View file

@ -0,0 +1,30 @@
/storage/aboba/evovis-client/src/main/java/defpackage/apt.java:430: error: local variables referenced from a lambda expression must be final or effectively final
.filter(var4x -> this.isValidPoint(var4, var4x, var2, var3))
^
/storage/aboba/evovis-client/src/main/java/defpackage/apt.java:431: error: local variables referenced from a lambda expression must be final or effectively final
.min(Comparator.comparingDouble(var1x -> var1x.distanceToSqr(var5)))
^
/storage/aboba/evovis-client/src/main/java/defpackage/apt.java:560: error: local variables referenced from a lambda expression must be final or effectively final
return var1.stream().min(Comparator.comparingDouble(var1x -> var1x.distanceToSqr(var2))).orElse(null);
^
Note: Some input files use or override a deprecated API.
Note: Recompile with -Xlint:deprecation for details.
Note: Some input files use unchecked or unsafe operations.
Note: Recompile with -Xlint:unchecked for details.
3 errors
FAILURE: Build failed with an exception.
* What went wrong:
Execution failed for task ':compileJava' (registered by plugin class 'org.gradle.api.plugins.JavaBasePlugin').
> Compilation failed; see the compiler output below.
/storage/aboba/evovis-client/src/main/java/defpackage/apt.java:430: error: local variables referenced from a lambda expression must be final or effectively final
.filter(var4x -> this.isValidPoint(var4, var4x, var2, var3))
^
3 errors
* Try:
> Check your code and dependencies to fix the compilation error(s)
> Run with --scan to get full insights from a Build Scan (powered by Develocity).
BUILD FAILED in 14s

24
build-logs/vfbuild55.log Normal file
View file

@ -0,0 +1,24 @@
/storage/aboba/evovis-client/src/main/java/defpackage/aqr.java:601: error: local variables referenced from a lambda expression must be final or effectively final
return SOURCES.computeIfAbsent(var0, var1x -> var2.factory().get());
^
Note: Some input files use or override a deprecated API.
Note: Recompile with -Xlint:deprecation for details.
Note: Some input files use unchecked or unsafe operations.
Note: Recompile with -Xlint:unchecked for details.
1 error
FAILURE: Build failed with an exception.
* What went wrong:
Execution failed for task ':compileJava' (registered by plugin class 'org.gradle.api.plugins.JavaBasePlugin').
> Compilation failed; see the compiler output below.
/storage/aboba/evovis-client/src/main/java/defpackage/aqr.java:601: error: local variables referenced from a lambda expression must be final or effectively final
return SOURCES.computeIfAbsent(var0, var1x -> var2.factory().get());
^
1 error
* Try:
> Check your code and dependencies to fix the compilation error(s)
> Run with --scan to get full insights from a Build Scan (powered by Develocity).
BUILD FAILED in 14s

27
build-logs/vfbuild56.log Normal file
View file

@ -0,0 +1,27 @@
/storage/aboba/evovis-client/src/main/java/defpackage/arh.java:127: error: local variables referenced from a lambda expression must be final or effectively final
QUAD.forEach(var2x -> quad(var2, var4, var2x.x, var2x.y, var2x.width, var2x.height, var2x.color));
^
/storage/aboba/evovis-client/src/main/java/defpackage/arh.java:127: error: local variables referenced from a lambda expression must be final or effectively final
QUAD.forEach(var2x -> quad(var2, var4, var2x.x, var2x.y, var2x.width, var2x.height, var2x.color));
^
Note: Some input files use or override a deprecated API.
Note: Recompile with -Xlint:deprecation for details.
Note: Some input files use unchecked or unsafe operations.
Note: Recompile with -Xlint:unchecked for details.
2 errors
FAILURE: Build failed with an exception.
* What went wrong:
Execution failed for task ':compileJava' (registered by plugin class 'org.gradle.api.plugins.JavaBasePlugin').
> Compilation failed; see the compiler output below.
/storage/aboba/evovis-client/src/main/java/defpackage/arh.java:127: error: local variables referenced from a lambda expression must be final or effectively final
QUAD.forEach(var2x -> quad(var2, var4, var2x.x, var2x.y, var2x.width, var2x.height, var2x.color));
^
2 errors
* Try:
> Check your code and dependencies to fix the compilation error(s)
> Run with --scan to get full insights from a Build Scan (powered by Develocity).
BUILD FAILED in 8s

51
build-logs/vfbuild57.log Normal file
View file

@ -0,0 +1,51 @@
/storage/aboba/evovis-client/src/main/java/defpackage/auk.java:54: error: local variables referenced from a lambda expression must be final or effectively final
BufferBuilder var3x = arj.begin(var3);
^
/storage/aboba/evovis-client/src/main/java/defpackage/auk.java:81: error: local variables referenced from a lambda expression must be final or effectively final
arj.draw(var3, var3x);
^
/storage/aboba/evovis-client/src/main/java/defpackage/auk.java:97: error: local variables referenced from a lambda expression must be final or effectively final
BufferBuilder var3x = arj.begin(var3);
^
/storage/aboba/evovis-client/src/main/java/defpackage/auk.java:125: error: local variables referenced from a lambda expression must be final or effectively final
arj.draw(var3, var3x);
^
/storage/aboba/evovis-client/src/main/java/defpackage/auk.java:135: error: local variables referenced from a lambda expression must be final or effectively final
QUAD_DEPTH.forEach(var2x -> vertexQuad(var1, var10, var2x.x, var2x.y, var2x.w, var2x.z, var2x.color));
^
/storage/aboba/evovis-client/src/main/java/defpackage/auk.java:152: error: local variables referenced from a lambda expression must be final or effectively final
QUAD.forEach(var2x -> vertexQuad(var1, var9, var2x.x, var2x.y, var2x.w, var2x.z, var2x.color));
^
/storage/aboba/evovis-client/src/main/java/defpackage/auk.java:237: error: local variables referenced from a lambda expression must be final or effectively final
.filter(var1x -> var1x.boxes.equals(var7))
^
/storage/aboba/evovis-client/src/main/java/defpackage/auk.java:244: error: local variables referenced from a lambda expression must be final or effectively final
var5xx.move(var6), var2, var3, (boolean)(((0)) != 0), var4, var5
^
/storage/aboba/evovis-client/src/main/java/defpackage/auk.java:247: error: local variables referenced from a lambda expression must be final or effectively final
var5x.lines.forEach(var4xx -> drawLine(var4xx.start.add(var6), var4xx.end.add(var6), var2, var3, var5));
^
/storage/aboba/evovis-client/src/main/java/defpackage/auk.java:247: error: local variables referenced from a lambda expression must be final or effectively final
var5x.lines.forEach(var4xx -> drawLine(var4xx.start.add(var6), var4xx.end.add(var6), var2, var3, var5));
^
Note: Some input files use or override a deprecated API.
Note: Recompile with -Xlint:deprecation for details.
Note: Some input files use unchecked or unsafe operations.
Note: Recompile with -Xlint:unchecked for details.
10 errors
FAILURE: Build failed with an exception.
* What went wrong:
Execution failed for task ':compileJava' (registered by plugin class 'org.gradle.api.plugins.JavaBasePlugin').
> Compilation failed; see the compiler output below.
/storage/aboba/evovis-client/src/main/java/defpackage/auk.java:54: error: local variables referenced from a lambda expression must be final or effectively final
BufferBuilder var3x = arj.begin(var3);
^
10 errors
* Try:
> Check your code and dependencies to fix the compilation error(s)
> Run with --scan to get full insights from a Build Scan (powered by Develocity).
BUILD FAILED in 9s

33
build-logs/vfbuild58.log Normal file
View file

@ -0,0 +1,33 @@
/storage/aboba/evovis-client/src/main/java/defpackage/aum.java:1236: error: local variables referenced from a lambda expression must be final or effectively final
var0[var1] = () -> var2;
^
/storage/aboba/evovis-client/src/main/java/defpackage/aum.java:1263: error: local variables referenced from a lambda expression must be final or effectively final
var0[var1] = () -> var2;
^
/storage/aboba/evovis-client/src/main/java/defpackage/aum.java:1296: error: local variables referenced from a lambda expression must be final or effectively final
var0[var1] = () -> var2;
^
/storage/aboba/evovis-client/src/main/java/defpackage/aum.java:1320: error: local variables referenced from a lambda expression must be final or effectively final
var0[var1] = () -> var2;
^
Note: Some input files use or override a deprecated API.
Note: Recompile with -Xlint:deprecation for details.
Note: Some input files use unchecked or unsafe operations.
Note: Recompile with -Xlint:unchecked for details.
4 errors
FAILURE: Build failed with an exception.
* What went wrong:
Execution failed for task ':compileJava' (registered by plugin class 'org.gradle.api.plugins.JavaBasePlugin').
> Compilation failed; see the compiler output below.
/storage/aboba/evovis-client/src/main/java/defpackage/aum.java:1236: error: local variables referenced from a lambda expression must be final or effectively final
var0[var1] = () -> var2;
^
4 errors
* Try:
> Check your code and dependencies to fix the compilation error(s)
> Run with --scan to get full insights from a Build Scan (powered by Develocity).
BUILD FAILED in 20s

24
build-logs/vfbuild59.log Normal file
View file

@ -0,0 +1,24 @@
/storage/aboba/evovis-client/src/main/java/defpackage/aup.java:767: error: local variables referenced from a lambda expression must be final or effectively final
var0[var1] = () -> var2;
^
Note: Some input files use or override a deprecated API.
Note: Recompile with -Xlint:deprecation for details.
Note: Some input files use unchecked or unsafe operations.
Note: Recompile with -Xlint:unchecked for details.
1 error
FAILURE: Build failed with an exception.
* What went wrong:
Execution failed for task ':compileJava' (registered by plugin class 'org.gradle.api.plugins.JavaBasePlugin').
> Compilation failed; see the compiler output below.
/storage/aboba/evovis-client/src/main/java/defpackage/aup.java:767: error: local variables referenced from a lambda expression must be final or effectively final
var0[var1] = () -> var2;
^
1 error
* Try:
> Check your code and dependencies to fix the compilation error(s)
> Run with --scan to get full insights from a Build Scan (powered by Develocity).
BUILD FAILED in 8s

72
build-logs/vfbuild60.log Normal file
View file

@ -0,0 +1,72 @@
/storage/aboba/evovis-client/src/main/java/defpackage/tr.java:1367: error: local variables referenced from a lambda expression must be final or effectively final
var27 = Math.max(var9, var21x * 0.002F);
^
/storage/aboba/evovis-client/src/main/java/defpackage/tr.java:1368: error: local variables referenced from a lambda expression must be final or effectively final
var28 = var8 * this.dropSpeed[var17x];
^
/storage/aboba/evovis-client/src/main/java/defpackage/tr.java:1369: error: local variables referenced from a lambda expression must be final or effectively final
var29 = var10 * var22x * this.dropAlpha[var17x];
^
/storage/aboba/evovis-client/src/main/java/defpackage/tr.java:1387: error: local variables referenced from a lambda expression must be final or effectively final
if (var17x < var15) {
^
/storage/aboba/evovis-client/src/main/java/defpackage/tr.java:1398: error: local variables referenced from a lambda expression must be final or effectively final
var13x = Mth.sqrt((float)(this.windX * this.windX + var6 * var6 + this.windZ * this.windZ));
^
/storage/aboba/evovis-client/src/main/java/defpackage/tr.java:1398: error: local variables referenced from a lambda expression must be final or effectively final
var13x = Mth.sqrt((float)(this.windX * this.windX + var6 * var6 + this.windZ * this.windZ));
^
/storage/aboba/evovis-client/src/main/java/defpackage/tr.java:1400: error: local variables referenced from a lambda expression must be final or effectively final
var15x = -var6 / var13x;
^
/storage/aboba/evovis-client/src/main/java/defpackage/tr.java:1452: error: local variables referenced from a lambda expression must be final or effectively final
if ((var18x * var12 + var19x * var13 + var20x * var14) / var21x < -0.35F) {
^
/storage/aboba/evovis-client/src/main/java/defpackage/tr.java:1452: error: local variables referenced from a lambda expression must be final or effectively final
if ((var18x * var12 + var19x * var13 + var20x * var14) / var21x < -0.35F) {
^
/storage/aboba/evovis-client/src/main/java/defpackage/tr.java:1452: error: local variables referenced from a lambda expression must be final or effectively final
if ((var18x * var12 + var19x * var13 + var20x * var14) / var21x < -0.35F) {
^
/storage/aboba/evovis-client/src/main/java/defpackage/tr.java:1574: error: local variables referenced from a lambda expression must be final or effectively final
if ((var14x * var9.x() + var16x * var9.y() + var18 * var9.z()) / var20 < -0.35F) {
^
/storage/aboba/evovis-client/src/main/java/defpackage/tr.java:1574: error: local variables referenced from a lambda expression must be final or effectively final
if ((var14x * var9.x() + var16x * var9.y() + var18 * var9.z()) / var20 < -0.35F) {
^
/storage/aboba/evovis-client/src/main/java/defpackage/tr.java:1574: error: local variables referenced from a lambda expression must be final or effectively final
if ((var14x * var9.x() + var16x * var9.y() + var18 * var9.z()) / var20 < -0.35F) {
^
/storage/aboba/evovis-client/src/main/java/defpackage/tr.java:1581: error: local variables referenced from a lambda expression must be final or effectively final
var12x = (var11 + var11x) % (128);
^
/storage/aboba/evovis-client/src/main/java/defpackage/tr.java:1582: error: local variables referenced from a lambda expression must be final or effectively final
var13x = (float)(var6 - this.splashStart[var12x]) / 360.0F;
^
/storage/aboba/evovis-client/src/main/java/defpackage/tr.java:1596: error: local variables referenced from a lambda expression must be final or effectively final
var25 = withAlpha(var5, var8 * (1.0F - var13x) * (1.0F - var13x));
^
/storage/aboba/evovis-client/src/main/java/defpackage/tr.java:1601: error: local variables referenced from a lambda expression must be final or effectively final
if (var11x < var10) {
^
Note: Some input files use or override a deprecated API.
Note: Recompile with -Xlint:deprecation for details.
Note: Some input files use unchecked or unsafe operations.
Note: Recompile with -Xlint:unchecked for details.
17 errors
FAILURE: Build failed with an exception.
* What went wrong:
Execution failed for task ':compileJava' (registered by plugin class 'org.gradle.api.plugins.JavaBasePlugin').
> Compilation failed; see the compiler output below.
/storage/aboba/evovis-client/src/main/java/defpackage/tr.java:1367: error: local variables referenced from a lambda expression must be final or effectively final
var27 = Math.max(var9, var21x * 0.002F);
^
17 errors
* Try:
> Check your code and dependencies to fix the compilation error(s)
> Run with --scan to get full insights from a Build Scan (powered by Develocity).
BUILD FAILED in 8s

27
build-logs/vfbuild61.log Normal file
View file

@ -0,0 +1,27 @@
/storage/aboba/evovis-client/src/main/java/defpackage/dq.java:56: error: local variables referenced from a lambda expression must be final or effectively final
((LiteralArgumentBuilder)literal(var6).executes(var1x -> start(var5, (-1504016657 ^ 1504016657) + ((-1504016657 & 1504016657) << 1))))
^
/storage/aboba/evovis-client/src/main/java/defpackage/dq.java:66: error: local variables referenced from a lambda expression must be final or effectively final
var5,
^
Note: Some input files use or override a deprecated API.
Note: Recompile with -Xlint:deprecation for details.
Note: Some input files use unchecked or unsafe operations.
Note: Recompile with -Xlint:unchecked for details.
2 errors
FAILURE: Build failed with an exception.
* What went wrong:
Execution failed for task ':compileJava' (registered by plugin class 'org.gradle.api.plugins.JavaBasePlugin').
> Compilation failed; see the compiler output below.
/storage/aboba/evovis-client/src/main/java/defpackage/dq.java:56: error: local variables referenced from a lambda expression must be final or effectively final
((LiteralArgumentBuilder)literal(var6).executes(var1x -> start(var5, (-1504016657 ^ 1504016657) + ((-1504016657 & 1504016657) << 1))))
^
2 errors
* Try:
> Check your code and dependencies to fix the compilation error(s)
> Run with --scan to get full insights from a Build Scan (powered by Develocity).
BUILD FAILED in 7s

24
build-logs/vfbuild62.log Normal file
View file

@ -0,0 +1,24 @@
/storage/aboba/evovis-client/src/main/java/defpackage/dw.java:35: error: local variables referenced from a lambda expression must be final or effectively final
throw new DynamicCommandExceptionType(var1x -> Component.literal("You have no friend " + var2)).create(var2);
^
Note: Some input files use or override a deprecated API.
Note: Recompile with -Xlint:deprecation for details.
Note: Some input files use unchecked or unsafe operations.
Note: Recompile with -Xlint:unchecked for details.
1 error
FAILURE: Build failed with an exception.
* What went wrong:
Execution failed for task ':compileJava' (registered by plugin class 'org.gradle.api.plugins.JavaBasePlugin').
> Compilation failed; see the compiler output below.
/storage/aboba/evovis-client/src/main/java/defpackage/dw.java:35: error: local variables referenced from a lambda expression must be final or effectively final
throw new DynamicCommandExceptionType(var1x -> Component.literal("You have no friend " + var2)).create(var2);
^
1 error
* Try:
> Check your code and dependencies to fix the compilation error(s)
> Run with --scan to get full insights from a Build Scan (powered by Develocity).
BUILD FAILED in 7s

24
build-logs/vfbuild63.log Normal file
View file

@ -0,0 +1,24 @@
/storage/aboba/evovis-client/src/main/java/defpackage/ej.java:295: error: local variables referenced from a lambda expression must be final or effectively final
() -> this.read(var1),
^
Note: Some input files use or override a deprecated API.
Note: Recompile with -Xlint:deprecation for details.
Note: Some input files use unchecked or unsafe operations.
Note: Recompile with -Xlint:unchecked for details.
1 error
FAILURE: Build failed with an exception.
* What went wrong:
Execution failed for task ':compileJava' (registered by plugin class 'org.gradle.api.plugins.JavaBasePlugin').
> Compilation failed; see the compiler output below.
/storage/aboba/evovis-client/src/main/java/defpackage/ej.java:295: error: local variables referenced from a lambda expression must be final or effectively final
() -> this.read(var1),
^
1 error
* Try:
> Check your code and dependencies to fix the compilation error(s)
> Run with --scan to get full insights from a Build Scan (powered by Develocity).
BUILD FAILED in 8s

28
build-logs/vfbuild64.log Normal file
View file

@ -0,0 +1,28 @@
/storage/aboba/evovis-client/src/main/java/defpackage/ej.java:295: error: cannot find symbol
() -> this.read(var1f),
^
symbol: variable var1f
location: class ej
Note: Some input files use or override a deprecated API.
Note: Recompile with -Xlint:deprecation for details.
Note: Some input files use unchecked or unsafe operations.
Note: Recompile with -Xlint:unchecked for details.
1 error
FAILURE: Build failed with an exception.
* What went wrong:
Execution failed for task ':compileJava' (registered by plugin class 'org.gradle.api.plugins.JavaBasePlugin').
> Compilation failed; see the compiler output below.
/storage/aboba/evovis-client/src/main/java/defpackage/ej.java:295: error: cannot find symbol
() -> this.read(var1f),
^
symbol: variable var1f
location: class ej
1 error
* Try:
> Check your code and dependencies to fix the compilation error(s)
> Run with --scan to get full insights from a Build Scan (powered by Develocity).
BUILD FAILED in 7s

30
build-logs/vfbuild65.log Normal file
View file

@ -0,0 +1,30 @@
/storage/aboba/evovis-client/src/main/java/defpackage/id.java:77: error: local variables referenced from a lambda expression must be final or effectively final
if (var0 != null) {
^
/storage/aboba/evovis-client/src/main/java/defpackage/id.java:86: error: local variables referenced from a lambda expression must be final or effectively final
var0.uncaughtException(var1x, var2x);
^
/storage/aboba/evovis-client/src/main/java/defpackage/id.java:432: error: local variables referenced from a lambda expression must be final or effectively final
var9 = SIGNALS.computeIfAbsent(var8, var3x -> new il(fingerprint(var3x), var0, var5));
^
Note: Some input files use or override a deprecated API.
Note: Recompile with -Xlint:deprecation for details.
Note: Some input files use unchecked or unsafe operations.
Note: Recompile with -Xlint:unchecked for details.
3 errors
FAILURE: Build failed with an exception.
* What went wrong:
Execution failed for task ':compileJava' (registered by plugin class 'org.gradle.api.plugins.JavaBasePlugin').
> Compilation failed; see the compiler output below.
/storage/aboba/evovis-client/src/main/java/defpackage/id.java:77: error: local variables referenced from a lambda expression must be final or effectively final
if (var0 != null) {
^
3 errors
* Try:
> Check your code and dependencies to fix the compilation error(s)
> Run with --scan to get full insights from a Build Scan (powered by Develocity).
BUILD FAILED in 8s

33
build-logs/vfbuild66.log Normal file
View file

@ -0,0 +1,33 @@
/storage/aboba/evovis-client/src/main/java/defpackage/id.java:77: error: cannot find symbol
if (var0f != null) {
^
symbol: variable var0f
location: class id
/storage/aboba/evovis-client/src/main/java/defpackage/id.java:86: error: cannot find symbol
var0f.uncaughtException(var1x, var2x);
^
symbol: variable var0f
location: class id
Note: Some input files use or override a deprecated API.
Note: Recompile with -Xlint:deprecation for details.
Note: Some input files use unchecked or unsafe operations.
Note: Recompile with -Xlint:unchecked for details.
2 errors
FAILURE: Build failed with an exception.
* What went wrong:
Execution failed for task ':compileJava' (registered by plugin class 'org.gradle.api.plugins.JavaBasePlugin').
> Compilation failed; see the compiler output below.
/storage/aboba/evovis-client/src/main/java/defpackage/id.java:77: error: cannot find symbol
if (var0f != null) {
^
symbol: variable var0f
location: class id
2 errors
* Try:
> Check your code and dependencies to fix the compilation error(s)
> Run with --scan to get full insights from a Build Scan (powered by Develocity).
BUILD FAILED in 7s

24
build-logs/vfbuild67.log Normal file
View file

@ -0,0 +1,24 @@
/storage/aboba/evovis-client/src/main/java/defpackage/j.java:251: error: local variables referenced from an inner class must be final or effectively final
this.add(var3);
^
Note: Some input files use or override a deprecated API.
Note: Recompile with -Xlint:deprecation for details.
Note: Some input files use unchecked or unsafe operations.
Note: Recompile with -Xlint:unchecked for details.
1 error
FAILURE: Build failed with an exception.
* What went wrong:
Execution failed for task ':compileJava' (registered by plugin class 'org.gradle.api.plugins.JavaBasePlugin').
> Compilation failed; see the compiler output below.
/storage/aboba/evovis-client/src/main/java/defpackage/j.java:251: error: local variables referenced from an inner class must be final or effectively final
this.add(var3);
^
1 error
* Try:
> Check your code and dependencies to fix the compilation error(s)
> Run with --scan to get full insights from a Build Scan (powered by Develocity).
BUILD FAILED in 8s

30
build-logs/vfbuild68.log Normal file
View file

@ -0,0 +1,30 @@
/storage/aboba/evovis-client/src/main/java/defpackage/ld.java:270: error: local variables referenced from a lambda expression must be final or effectively final
markWorking(var5);
^
/storage/aboba/evovis-client/src/main/java/defpackage/ld.java:277: error: local variables referenced from a lambda expression must be final or effectively final
var5,
^
/storage/aboba/evovis-client/src/main/java/defpackage/ld.java:281: error: local variables referenced from a lambda expression must be final or effectively final
if (var6 == 0) {
^
Note: Some input files use or override a deprecated API.
Note: Recompile with -Xlint:deprecation for details.
Note: Some input files use unchecked or unsafe operations.
Note: Recompile with -Xlint:unchecked for details.
3 errors
FAILURE: Build failed with an exception.
* What went wrong:
Execution failed for task ':compileJava' (registered by plugin class 'org.gradle.api.plugins.JavaBasePlugin').
> Compilation failed; see the compiler output below.
/storage/aboba/evovis-client/src/main/java/defpackage/ld.java:270: error: local variables referenced from a lambda expression must be final or effectively final
markWorking(var5);
^
3 errors
* Try:
> Check your code and dependencies to fix the compilation error(s)
> Run with --scan to get full insights from a Build Scan (powered by Develocity).
BUILD FAILED in 7s

36
build-logs/vfbuild69.log Normal file
View file

@ -0,0 +1,36 @@
/storage/aboba/evovis-client/src/main/java/defpackage/nj.java:1036: error: local variables referenced from a lambda expression must be final or effectively final
var1x.setBackdrop(new nl((nk)var3, var3x, var2x.speed(), var2x.scale()));
^
/storage/aboba/evovis-client/src/main/java/defpackage/nj.java:1045: error: local variables referenced from a lambda expression must be final or effectively final
if (var3 != nk.NONE) {
^
/storage/aboba/evovis-client/src/main/java/defpackage/nj.java:1076: error: local variables referenced from a lambda expression must be final or effectively final
if (var1x.getBackdrop().mode() == var3) {
^
/storage/aboba/evovis-client/src/main/java/defpackage/nj.java:1210: error: local variables referenced from a lambda expression must be final or effectively final
var1x.setPalette(var1x.getPalette().withGenerated((boolean)(((1)) != 0)).withPolarity(var6));
^
/storage/aboba/evovis-client/src/main/java/defpackage/nj.java:1224: error: local variables referenced from a lambda expression must be final or effectively final
if (var1x.getPalette().polarity() == var6) {
^
Note: Some input files use or override a deprecated API.
Note: Recompile with -Xlint:deprecation for details.
Note: Some input files use unchecked or unsafe operations.
Note: Recompile with -Xlint:unchecked for details.
5 errors
FAILURE: Build failed with an exception.
* What went wrong:
Execution failed for task ':compileJava' (registered by plugin class 'org.gradle.api.plugins.JavaBasePlugin').
> Compilation failed; see the compiler output below.
/storage/aboba/evovis-client/src/main/java/defpackage/nj.java:1036: error: local variables referenced from a lambda expression must be final or effectively final
var1x.setBackdrop(new nl((nk)var3, var3x, var2x.speed(), var2x.scale()));
^
5 errors
* Try:
> Check your code and dependencies to fix the compilation error(s)
> Run with --scan to get full insights from a Build Scan (powered by Develocity).
BUILD FAILED in 8s

111
build-logs/vfbuild70.log Normal file
View file

@ -0,0 +1,111 @@
/storage/aboba/evovis-client/src/main/java/defpackage/op.java:1151: error: local variables referenced from a lambda expression must be final or effectively final
var1x -> var1x.getElevation().softness(var4),
^
/storage/aboba/evovis-client/src/main/java/defpackage/op.java:1152: error: local variables referenced from a lambda expression must be final or effectively final
(var1x, var2x) -> var1x.setElevation(var1x.getElevation().withLevel(var4, var2x, var1x.getElevation().alpha(var4))),
^
/storage/aboba/evovis-client/src/main/java/defpackage/op.java:1152: error: local variables referenced from a lambda expression must be final or effectively final
(var1x, var2x) -> var1x.setElevation(var1x.getElevation().withLevel(var4, var2x, var1x.getElevation().alpha(var4))),
^
/storage/aboba/evovis-client/src/main/java/defpackage/op.java:1153: error: local variables referenced from a lambda expression must be final or effectively final
var1x -> var1x.getDefaultElevation().softness(var4)
^
/storage/aboba/evovis-client/src/main/java/defpackage/op.java:1164: error: local variables referenced from a lambda expression must be final or effectively final
var1x -> var1x.getElevation().alpha(var4),
^
/storage/aboba/evovis-client/src/main/java/defpackage/op.java:1165: error: local variables referenced from a lambda expression must be final or effectively final
(var1x, var2x) -> var1x.setElevation(var1x.getElevation().withLevel(var4, var1x.getElevation().softness(var4), var2x)),
^
/storage/aboba/evovis-client/src/main/java/defpackage/op.java:1165: error: local variables referenced from a lambda expression must be final or effectively final
(var1x, var2x) -> var1x.setElevation(var1x.getElevation().withLevel(var4, var1x.getElevation().softness(var4), var2x)),
^
/storage/aboba/evovis-client/src/main/java/defpackage/op.java:1166: error: local variables referenced from a lambda expression must be final or effectively final
var1x -> var1x.getDefaultElevation().alpha(var4)
^
/storage/aboba/evovis-client/src/main/java/defpackage/op.java:1203: error: local variables referenced from a lambda expression must be final or effectively final
var1x -> var1x.getMotion().duration(var4),
^
/storage/aboba/evovis-client/src/main/java/defpackage/op.java:1204: error: local variables referenced from a lambda expression must be final or effectively final
(var1x, var2x) -> var1x.setMotion(var1x.getMotion().withDuration(var4, Math.round(var2x))),
^
/storage/aboba/evovis-client/src/main/java/defpackage/op.java:1205: error: local variables referenced from a lambda expression must be final or effectively final
var1x -> var1x.getDefaultMotion().duration(var4)
^
/storage/aboba/evovis-client/src/main/java/defpackage/op.java:1291: error: local variables referenced from a lambda expression must be final or effectively final
var1x -> var1x.getTypography().sizes()[var5.ordinal()],
^
/storage/aboba/evovis-client/src/main/java/defpackage/op.java:1292: error: local variables referenced from a lambda expression must be final or effectively final
(var1x, var2x) -> var1x.setTypography(var1x.getTypography().withSize(var5, var2x)),
^
/storage/aboba/evovis-client/src/main/java/defpackage/op.java:1293: error: local variables referenced from a lambda expression must be final or effectively final
var1x -> var1x.getDefaultTypography().sizes()[var5.ordinal()]
^
/storage/aboba/evovis-client/src/main/java/defpackage/op.java:1302: error: local variables referenced from a lambda expression must be final or effectively final
var1x -> titleCase(var1x.getTypography().family(var5).name()),
^
/storage/aboba/evovis-client/src/main/java/defpackage/op.java:1304: error: local variables referenced from a lambda expression must be final or effectively final
var1x.getTypography().withFamily(var5, byTitle(oa.values(), var2x, var1x.getTypography().family(var5)))
^
/storage/aboba/evovis-client/src/main/java/defpackage/op.java:1304: error: local variables referenced from a lambda expression must be final or effectively final
var1x.getTypography().withFamily(var5, byTitle(oa.values(), var2x, var1x.getTypography().family(var5)))
^
/storage/aboba/evovis-client/src/main/java/defpackage/op.java:1306: error: local variables referenced from a lambda expression must be final or effectively final
var1x -> titleCase(var1x.getDefaultTypography().family(var5).name())
^
/storage/aboba/evovis-client/src/main/java/defpackage/op.java:1334: error: local variables referenced from a lambda expression must be final or effectively final
var1x -> var1x.getSpacing().steps()[var4.ordinal()],
^
/storage/aboba/evovis-client/src/main/java/defpackage/op.java:1335: error: local variables referenced from a lambda expression must be final or effectively final
(var1x, var2x) -> var1x.setSpacing(var1x.getSpacing().withStep(var4, var2x)),
^
/storage/aboba/evovis-client/src/main/java/defpackage/op.java:1336: error: local variables referenced from a lambda expression must be final or effectively final
var1x -> var1x.getDefaultSpacing().steps()[var4.ordinal()]
^
/storage/aboba/evovis-client/src/main/java/defpackage/op.java:1426: error: local variables referenced from a lambda expression must be final or effectively final
var1x -> var1x.getGeometry().roleRadiusScale()[var5.ordinal()],
^
/storage/aboba/evovis-client/src/main/java/defpackage/op.java:1427: error: local variables referenced from a lambda expression must be final or effectively final
(var1x, var2x) -> var1x.setGeometry(var1x.getGeometry().withRoleRadiusScale(var5, var2x)),
^
/storage/aboba/evovis-client/src/main/java/defpackage/op.java:1428: error: local variables referenced from a lambda expression must be final or effectively final
var1x -> var1x.getDefaultGeometry().roleRadiusScale()[var5.ordinal()]
^
/storage/aboba/evovis-client/src/main/java/defpackage/op.java:1439: error: local variables referenced from a lambda expression must be final or effectively final
var1x -> var1x.getEffects().roleNeonScale()[var5.ordinal()],
^
/storage/aboba/evovis-client/src/main/java/defpackage/op.java:1440: error: local variables referenced from a lambda expression must be final or effectively final
(var1x, var2x) -> var1x.setEffects(var1x.getEffects().withRoleNeonScale(var5, var2x)),
^
/storage/aboba/evovis-client/src/main/java/defpackage/op.java:1441: error: local variables referenced from a lambda expression must be final or effectively final
var1x -> var1x.getDefaultEffects().roleNeonScale()[var5.ordinal()]
^
/storage/aboba/evovis-client/src/main/java/defpackage/op.java:1450: error: local variables referenced from a lambda expression must be final or effectively final
var1x -> tierName(var1x.getGlass().roleTier()[var5.ordinal()]),
^
/storage/aboba/evovis-client/src/main/java/defpackage/op.java:1451: error: local variables referenced from a lambda expression must be final or effectively final
(var1x, var2x) -> var1x.setGlass(var1x.getGlass().withTier(var5, tierByName(var2x))),
^
/storage/aboba/evovis-client/src/main/java/defpackage/op.java:1452: error: local variables referenced from a lambda expression must be final or effectively final
var1x -> tierName(var1x.getDefaultGlass().roleTier()[var5.ordinal()])
^
Note: Some input files use or override a deprecated API.
Note: Recompile with -Xlint:deprecation for details.
Note: Some input files use unchecked or unsafe operations.
Note: Recompile with -Xlint:unchecked for details.
30 errors
FAILURE: Build failed with an exception.
* What went wrong:
Execution failed for task ':compileJava' (registered by plugin class 'org.gradle.api.plugins.JavaBasePlugin').
> Compilation failed; see the compiler output below.
/storage/aboba/evovis-client/src/main/java/defpackage/op.java:1151: error: local variables referenced from a lambda expression must be final or effectively final
var1x -> var1x.getElevation().softness(var4),
^
30 errors
* Try:
> Check your code and dependencies to fix the compilation error(s)
> Run with --scan to get full insights from a Build Scan (powered by Develocity).
BUILD FAILED in 8s

33
build-logs/vfbuild71.log Normal file
View file

@ -0,0 +1,33 @@
/storage/aboba/evovis-client/src/main/java/defpackage/qq.java:235: error: local variables referenced from a lambda expression must be final or effectively final
this.modules.computeIfAbsent(var8, var5x -> new qo(this, var10, var8, var6, var9));
^
/storage/aboba/evovis-client/src/main/java/defpackage/qq.java:235: error: local variables referenced from a lambda expression must be final or effectively final
this.modules.computeIfAbsent(var8, var5x -> new qo(this, var10, var8, var6, var9));
^
/storage/aboba/evovis-client/src/main/java/defpackage/qq.java:235: error: local variables referenced from a lambda expression must be final or effectively final
this.modules.computeIfAbsent(var8, var5x -> new qo(this, var10, var8, var6, var9));
^
/storage/aboba/evovis-client/src/main/java/defpackage/qq.java:235: error: local variables referenced from a lambda expression must be final or effectively final
this.modules.computeIfAbsent(var8, var5x -> new qo(this, var10, var8, var6, var9));
^
Note: Some input files use or override a deprecated API.
Note: Recompile with -Xlint:deprecation for details.
Note: Some input files use unchecked or unsafe operations.
Note: Recompile with -Xlint:unchecked for details.
4 errors
FAILURE: Build failed with an exception.
* What went wrong:
Execution failed for task ':compileJava' (registered by plugin class 'org.gradle.api.plugins.JavaBasePlugin').
> Compilation failed; see the compiler output below.
/storage/aboba/evovis-client/src/main/java/defpackage/qq.java:235: error: local variables referenced from a lambda expression must be final or effectively final
this.modules.computeIfAbsent(var8, var5x -> new qo(this, var10, var8, var6, var9));
^
4 errors
* Try:
> Check your code and dependencies to fix the compilation error(s)
> Run with --scan to get full insights from a Build Scan (powered by Develocity).
BUILD FAILED in 7s

30
build-logs/vfbuild72.log Normal file
View file

@ -0,0 +1,30 @@
/storage/aboba/evovis-client/src/main/java/defpackage/tk.java:446: error: local variables referenced from a lambda expression must be final or effectively final
addFilledBox(var4x, var3x, new AABB(var6x).inflate(0.002), var6, var9);
^
/storage/aboba/evovis-client/src/main/java/defpackage/tk.java:446: error: local variables referenced from a lambda expression must be final or effectively final
addFilledBox(var4x, var3x, new AABB(var6x).inflate(0.002), var6, var9);
^
/storage/aboba/evovis-client/src/main/java/defpackage/tk.java:458: error: local variables referenced from a lambda expression must be final or effectively final
var5x = var5.iterator();
^
Note: Some input files use or override a deprecated API.
Note: Recompile with -Xlint:deprecation for details.
Note: Some input files use unchecked or unsafe operations.
Note: Recompile with -Xlint:unchecked for details.
3 errors
FAILURE: Build failed with an exception.
* What went wrong:
Execution failed for task ':compileJava' (registered by plugin class 'org.gradle.api.plugins.JavaBasePlugin').
> Compilation failed; see the compiler output below.
/storage/aboba/evovis-client/src/main/java/defpackage/tk.java:446: error: local variables referenced from a lambda expression must be final or effectively final
addFilledBox(var4x, var3x, new AABB(var6x).inflate(0.002), var6, var9);
^
3 errors
* Try:
> Check your code and dependencies to fix the compilation error(s)
> Run with --scan to get full insights from a Build Scan (powered by Develocity).
BUILD FAILED in 7s

66
build-logs/vfbuild73.log Normal file
View file

@ -0,0 +1,66 @@
/storage/aboba/evovis-client/src/main/java/defpackage/ts.java:1123: error: local variables referenced from a lambda expression must be final or effectively final
var27x = var13;
^
/storage/aboba/evovis-client/src/main/java/defpackage/ts.java:1124: error: local variables referenced from a lambda expression must be final or effectively final
var28x = var14;
^
/storage/aboba/evovis-client/src/main/java/defpackage/ts.java:1125: error: local variables referenced from a lambda expression must be final or effectively final
var29 = var15;
^
/storage/aboba/evovis-client/src/main/java/defpackage/ts.java:1155: error: local variables referenced from a lambda expression must be final or effectively final
if (var14x < var16) {
^
/storage/aboba/evovis-client/src/main/java/defpackage/ts.java:1178: error: local variables referenced from a lambda expression must be final or effectively final
var30 = var14 * var21x - var15 * var20x;
^
/storage/aboba/evovis-client/src/main/java/defpackage/ts.java:1178: error: local variables referenced from a lambda expression must be final or effectively final
var30 = var14 * var21x - var15 * var20x;
^
/storage/aboba/evovis-client/src/main/java/defpackage/ts.java:1179: error: local variables referenced from a lambda expression must be final or effectively final
var31 = var15 * var19x - var13 * var21x;
^
/storage/aboba/evovis-client/src/main/java/defpackage/ts.java:1179: error: local variables referenced from a lambda expression must be final or effectively final
var31 = var15 * var19x - var13 * var21x;
^
/storage/aboba/evovis-client/src/main/java/defpackage/ts.java:1180: error: local variables referenced from a lambda expression must be final or effectively final
var32 = var13 * var20x - var14 * var19x;
^
/storage/aboba/evovis-client/src/main/java/defpackage/ts.java:1180: error: local variables referenced from a lambda expression must be final or effectively final
var32 = var13 * var20x - var14 * var19x;
^
/storage/aboba/evovis-client/src/main/java/defpackage/ts.java:1212: error: local variables referenced from a lambda expression must be final or effectively final
if (var19x * var10 + var20x * var11 + var21x * var12 < -0.35F) {
^
/storage/aboba/evovis-client/src/main/java/defpackage/ts.java:1212: error: local variables referenced from a lambda expression must be final or effectively final
if (var19x * var10 + var20x * var11 + var21x * var12 < -0.35F) {
^
/storage/aboba/evovis-client/src/main/java/defpackage/ts.java:1212: error: local variables referenced from a lambda expression must be final or effectively final
if (var19x * var10 + var20x * var11 + var21x * var12 < -0.35F) {
^
/storage/aboba/evovis-client/src/main/java/defpackage/ts.java:1222: error: local variables referenced from a lambda expression must be final or effectively final
var34 = Math.max(var6 * this.flakeSize[var14x], var18x * 0.0024F);
^
/storage/aboba/evovis-client/src/main/java/defpackage/ts.java:1226: error: local variables referenced from a lambda expression must be final or effectively final
var38 = withAlpha(var5, var7 * var22x * this.flakeAlpha[var14x]);
^
Note: Some input files use or override a deprecated API.
Note: Recompile with -Xlint:deprecation for details.
Note: Some input files use unchecked or unsafe operations.
Note: Recompile with -Xlint:unchecked for details.
15 errors
FAILURE: Build failed with an exception.
* What went wrong:
Execution failed for task ':compileJava' (registered by plugin class 'org.gradle.api.plugins.JavaBasePlugin').
> Compilation failed; see the compiler output below.
/storage/aboba/evovis-client/src/main/java/defpackage/ts.java:1123: error: local variables referenced from a lambda expression must be final or effectively final
var27x = var13;
^
15 errors
* Try:
> Check your code and dependencies to fix the compilation error(s)
> Run with --scan to get full insights from a Build Scan (powered by Develocity).
BUILD FAILED in 7s

24
build-logs/vfbuild74.log Normal file
View file

@ -0,0 +1,24 @@
/storage/aboba/evovis-client/src/main/java/defpackage/xa.java:370: error: local variables referenced from a lambda expression must be final or effectively final
.map(var1x -> new wz(var2, var1x, wx.of(var1x)));
^
Note: Some input files use or override a deprecated API.
Note: Recompile with -Xlint:deprecation for details.
Note: Some input files use unchecked or unsafe operations.
Note: Recompile with -Xlint:unchecked for details.
1 error
FAILURE: Build failed with an exception.
* What went wrong:
Execution failed for task ':compileJava' (registered by plugin class 'org.gradle.api.plugins.JavaBasePlugin').
> Compilation failed; see the compiler output below.
/storage/aboba/evovis-client/src/main/java/defpackage/xa.java:370: error: local variables referenced from a lambda expression must be final or effectively final
.map(var1x -> new wz(var2, var1x, wx.of(var1x)));
^
1 error
* Try:
> Check your code and dependencies to fix the compilation error(s)
> Run with --scan to get full insights from a Build Scan (powered by Develocity).
BUILD FAILED in 8s

144
build-logs/vfbuild75.log Normal file
View file

@ -0,0 +1,144 @@
/storage/aboba/evovis-client/src/main/java/defpackage/up.java:2166: error: local variables referenced from a lambda expression must be final or effectively final
this.drawBox(var8x, var7x, var17, var18, var19, var16.u(), var16.v(), var16.widthPx(), var16.heightPx(), var16.depthPx(), var10, var15);
^
/storage/aboba/evovis-client/src/main/java/defpackage/up.java:2166: error: local variables referenced from a lambda expression must be final or effectively final
this.drawBox(var8x, var7x, var17, var18, var19, var16.u(), var16.v(), var16.widthPx(), var16.heightPx(), var16.depthPx(), var10, var15);
^
/storage/aboba/evovis-client/src/main/java/defpackage/up.java:2166: error: local variables referenced from a lambda expression must be final or effectively final
this.drawBox(var8x, var7x, var17, var18, var19, var16.u(), var16.v(), var16.widthPx(), var16.heightPx(), var16.depthPx(), var10, var15);
^
/storage/aboba/evovis-client/src/main/java/defpackage/up.java:2166: error: local variables referenced from a lambda expression must be final or effectively final
this.drawBox(var8x, var7x, var17, var18, var19, var16.u(), var16.v(), var16.widthPx(), var16.heightPx(), var16.depthPx(), var10, var15);
^
/storage/aboba/evovis-client/src/main/java/defpackage/up.java:2166: error: local variables referenced from a lambda expression must be final or effectively final
this.drawBox(var8x, var7x, var17, var18, var19, var16.u(), var16.v(), var16.widthPx(), var16.heightPx(), var16.depthPx(), var10, var15);
^
/storage/aboba/evovis-client/src/main/java/defpackage/up.java:2166: error: local variables referenced from a lambda expression must be final or effectively final
this.drawBox(var8x, var7x, var17, var18, var19, var16.u(), var16.v(), var16.widthPx(), var16.heightPx(), var16.depthPx(), var10, var15);
^
/storage/aboba/evovis-client/src/main/java/defpackage/up.java:2166: error: local variables referenced from a lambda expression must be final or effectively final
this.drawBox(var8x, var7x, var17, var18, var19, var16.u(), var16.v(), var16.widthPx(), var16.heightPx(), var16.depthPx(), var10, var15);
^
/storage/aboba/evovis-client/src/main/java/defpackage/up.java:2166: error: local variables referenced from a lambda expression must be final or effectively final
this.drawBox(var8x, var7x, var17, var18, var19, var16.u(), var16.v(), var16.widthPx(), var16.heightPx(), var16.depthPx(), var10, var15);
^
/storage/aboba/evovis-client/src/main/java/defpackage/up.java:2166: error: local variables referenced from a lambda expression must be final or effectively final
this.drawBox(var8x, var7x, var17, var18, var19, var16.u(), var16.v(), var16.widthPx(), var16.heightPx(), var16.depthPx(), var10, var15);
^
/storage/aboba/evovis-client/src/main/java/defpackage/up.java:2166: error: local variables referenced from a lambda expression must be final or effectively final
this.drawBox(var8x, var7x, var17, var18, var19, var16.u(), var16.v(), var16.widthPx(), var16.heightPx(), var16.depthPx(), var10, var15);
^
/storage/aboba/evovis-client/src/main/java/defpackage/up.java:2171: error: local variables referenced from a lambda expression must be final or effectively final
var17 + var9x,
^
/storage/aboba/evovis-client/src/main/java/defpackage/up.java:2172: error: local variables referenced from a lambda expression must be final or effectively final
var18 + var9x,
^
/storage/aboba/evovis-client/src/main/java/defpackage/up.java:2173: error: local variables referenced from a lambda expression must be final or effectively final
var19 + var9x,
^
/storage/aboba/evovis-client/src/main/java/defpackage/up.java:2174: error: local variables referenced from a lambda expression must be final or effectively final
var16.overlayU(),
^
/storage/aboba/evovis-client/src/main/java/defpackage/up.java:2175: error: local variables referenced from a lambda expression must be final or effectively final
var16.overlayV(),
^
/storage/aboba/evovis-client/src/main/java/defpackage/up.java:2176: error: local variables referenced from a lambda expression must be final or effectively final
var16.widthPx(),
^
/storage/aboba/evovis-client/src/main/java/defpackage/up.java:2177: error: local variables referenced from a lambda expression must be final or effectively final
var16.heightPx(),
^
/storage/aboba/evovis-client/src/main/java/defpackage/up.java:2178: error: local variables referenced from a lambda expression must be final or effectively final
var16.depthPx(),
^
/storage/aboba/evovis-client/src/main/java/defpackage/up.java:2179: error: local variables referenced from a lambda expression must be final or effectively final
var10,
^
/storage/aboba/evovis-client/src/main/java/defpackage/up.java:2180: error: local variables referenced from a lambda expression must be final or effectively final
var15
^
/storage/aboba/evovis-client/src/main/java/defpackage/up.java:2677: error: local variables referenced from a lambda expression must be final or effectively final
var26 = var11 * var13x.size;
^
/storage/aboba/evovis-client/src/main/java/defpackage/up.java:2678: error: local variables referenced from a lambda expression must be final or effectively final
var27 = var12 * var13x.size;
^
/storage/aboba/evovis-client/src/main/java/defpackage/up.java:2679: error: local variables referenced from a lambda expression must be final or effectively final
var28 = var13 * var13x.size;
^
/storage/aboba/evovis-client/src/main/java/defpackage/up.java:2680: error: local variables referenced from a lambda expression must be final or effectively final
var29 = var14 * var13x.size + var23;
^
/storage/aboba/evovis-client/src/main/java/defpackage/up.java:2681: error: local variables referenced from a lambda expression must be final or effectively final
var30 = var15 * var13x.size + var24;
^
/storage/aboba/evovis-client/src/main/java/defpackage/up.java:2682: error: local variables referenced from a lambda expression must be final or effectively final
var31 = var16 * var13x.size + var25;
^
/storage/aboba/evovis-client/src/main/java/defpackage/up.java:2873: error: local variables referenced from a lambda expression must be final or effectively final
var9x = (var7x / 10.0F + var6 * 0.8F) % 1.0F;
^
/storage/aboba/evovis-client/src/main/java/defpackage/up.java:2874: error: local variables referenced from a lambda expression must be final or effectively final
var10x = var8x + var6 * 1.6F * (float) (Math.PI * 2);
^
/storage/aboba/evovis-client/src/main/java/defpackage/up.java:2875: error: local variables referenced from a lambda expression must be final or effectively final
var11x = 0.45F + 0.2F * Mth.sin(var8x * 3.0F + var6 * 4.0F);
^
/storage/aboba/evovis-client/src/main/java/defpackage/up.java:2877: error: local variables referenced from a lambda expression must be final or effectively final
var14x = var1.groundY + var11 * 0.6F + var9x * 2.2F;
^
/storage/aboba/evovis-client/src/main/java/defpackage/up.java:2881: error: local variables referenced from a lambda expression must be final or effectively final
var20x = Mth.clamp(var15 * (1.0F - var9x) * 1.6F, 0.0F, 1.0F);
^
/storage/aboba/evovis-client/src/main/java/defpackage/up.java:2949: error: local variables referenced from a lambda expression must be final or effectively final
var20.widthPx() * 0.0625F * 0.5F,
^
/storage/aboba/evovis-client/src/main/java/defpackage/up.java:2950: error: local variables referenced from a lambda expression must be final or effectively final
var20.heightPx() * 0.0625F * 0.5F,
^
/storage/aboba/evovis-client/src/main/java/defpackage/up.java:2951: error: local variables referenced from a lambda expression must be final or effectively final
var20.depthPx() * 0.0625F * 0.5F,
^
/storage/aboba/evovis-client/src/main/java/defpackage/up.java:2952: error: local variables referenced from a lambda expression must be final or effectively final
var20.u(),
^
/storage/aboba/evovis-client/src/main/java/defpackage/up.java:2953: error: local variables referenced from a lambda expression must be final or effectively final
var20.v(),
^
/storage/aboba/evovis-client/src/main/java/defpackage/up.java:2954: error: local variables referenced from a lambda expression must be final or effectively final
var20.widthPx(),
^
/storage/aboba/evovis-client/src/main/java/defpackage/up.java:2955: error: local variables referenced from a lambda expression must be final or effectively final
var20.heightPx(),
^
/storage/aboba/evovis-client/src/main/java/defpackage/up.java:2956: error: local variables referenced from a lambda expression must be final or effectively final
var20.depthPx(),
^
/storage/aboba/evovis-client/src/main/java/defpackage/up.java:2957: error: local variables referenced from a lambda expression must be final or effectively final
var13,
^
/storage/aboba/evovis-client/src/main/java/defpackage/up.java:2958: error: local variables referenced from a lambda expression must be final or effectively final
var14
^
Note: Some input files use or override a deprecated API.
Note: Recompile with -Xlint:deprecation for details.
Note: Some input files use unchecked or unsafe operations.
Note: Recompile with -Xlint:unchecked for details.
41 errors
FAILURE: Build failed with an exception.
* What went wrong:
Execution failed for task ':compileJava' (registered by plugin class 'org.gradle.api.plugins.JavaBasePlugin').
> Compilation failed; see the compiler output below.
/storage/aboba/evovis-client/src/main/java/defpackage/up.java:2166: error: local variables referenced from a lambda expression must be final or effectively final
this.drawBox(var8x, var7x, var17, var18, var19, var16.u(), var16.v(), var16.widthPx(), var16.heightPx(), var16.depthPx(), var10, var15);
^
41 errors
* Try:
> Check your code and dependencies to fix the compilation error(s)
> Run with --scan to get full insights from a Build Scan (powered by Develocity).
BUILD FAILED in 7s

25
build-logs/vfbuild76.log Normal file
View file

@ -0,0 +1,25 @@
/storage/aboba/evovis-client/src/main/java/defpackage/up.java:2975: error: incompatible types: possible lossy conversion from float to int
var13f,
^
Note: Some input files use or override a deprecated API.
Note: Recompile with -Xlint:deprecation for details.
Note: Some input files use unchecked or unsafe operations.
Note: Recompile with -Xlint:unchecked for details.
Note: Some messages have been simplified; recompile with -Xdiags:verbose to get full output
1 error
FAILURE: Build failed with an exception.
* What went wrong:
Execution failed for task ':compileJava' (registered by plugin class 'org.gradle.api.plugins.JavaBasePlugin').
> Compilation failed; see the compiler output below.
/storage/aboba/evovis-client/src/main/java/defpackage/up.java:2975: error: incompatible types: possible lossy conversion from float to int
var13f,
^
1 error
* Try:
> Check your code and dependencies to fix the compilation error(s)
> Run with --scan to get full insights from a Build Scan (powered by Develocity).
BUILD FAILED in 19s

45
build-logs/vfbuild77.log Normal file
View file

@ -0,0 +1,45 @@
/storage/aboba/evovis-client/src/main/java/defpackage/vd.java:468: error: local variables referenced from a lambda expression must be final or effectively final
this.drawWorldPanel(var2, var15, var13, () -> this.drawWindow(var2, var3, var11, var17));
^
/storage/aboba/evovis-client/src/main/java/defpackage/vd.java:468: error: local variables referenced from a lambda expression must be final or effectively final
this.drawWorldPanel(var2, var15, var13, () -> this.drawWindow(var2, var3, var11, var17));
^
/storage/aboba/evovis-client/src/main/java/defpackage/vd.java:468: error: local variables referenced from a lambda expression must be final or effectively final
this.drawWorldPanel(var2, var15, var13, () -> this.drawWindow(var2, var3, var11, var17));
^
/storage/aboba/evovis-client/src/main/java/defpackage/vd.java:468: error: local variables referenced from a lambda expression must be final or effectively final
this.drawWorldPanel(var2, var15, var13, () -> this.drawWindow(var2, var3, var11, var17));
^
/storage/aboba/evovis-client/src/main/java/defpackage/vd.java:581: error: local variables referenced from a lambda expression must be final or effectively final
this.drawWorldPanel(var2, var15, var13, () -> this.drawVideoWindow(var2, var3, var12, var17));
^
/storage/aboba/evovis-client/src/main/java/defpackage/vd.java:581: error: local variables referenced from a lambda expression must be final or effectively final
this.drawWorldPanel(var2, var15, var13, () -> this.drawVideoWindow(var2, var3, var12, var17));
^
/storage/aboba/evovis-client/src/main/java/defpackage/vd.java:581: error: local variables referenced from a lambda expression must be final or effectively final
this.drawWorldPanel(var2, var15, var13, () -> this.drawVideoWindow(var2, var3, var12, var17));
^
/storage/aboba/evovis-client/src/main/java/defpackage/vd.java:581: error: local variables referenced from a lambda expression must be final or effectively final
this.drawWorldPanel(var2, var15, var13, () -> this.drawVideoWindow(var2, var3, var12, var17));
^
Note: Some input files use or override a deprecated API.
Note: Recompile with -Xlint:deprecation for details.
Note: Some input files use unchecked or unsafe operations.
Note: Recompile with -Xlint:unchecked for details.
8 errors
FAILURE: Build failed with an exception.
* What went wrong:
Execution failed for task ':compileJava' (registered by plugin class 'org.gradle.api.plugins.JavaBasePlugin').
> Compilation failed; see the compiler output below.
/storage/aboba/evovis-client/src/main/java/defpackage/vd.java:468: error: local variables referenced from a lambda expression must be final or effectively final
this.drawWorldPanel(var2, var15, var13, () -> this.drawWindow(var2, var3, var11, var17));
^
8 errors
* Try:
> Check your code and dependencies to fix the compilation error(s)
> Run with --scan to get full insights from a Build Scan (powered by Develocity).
BUILD FAILED in 8s

30
build-logs/vfbuild78.log Normal file
View file

@ -0,0 +1,30 @@
/storage/aboba/evovis-client/src/main/java/defpackage/vd.java:585: error: variable var2f is already defined in method onRender(fs)
final aru var2f = var2;
^
/storage/aboba/evovis-client/src/main/java/defpackage/vd.java:586: error: variable var3f is already defined in method onRender(fs)
final mv var3f = var3;
^
/storage/aboba/evovis-client/src/main/java/defpackage/vd.java:588: error: variable var17f is already defined in method onRender(fs)
final float var17f = var17;
^
Note: Some input files use or override a deprecated API.
Note: Recompile with -Xlint:deprecation for details.
Note: Some input files use unchecked or unsafe operations.
Note: Recompile with -Xlint:unchecked for details.
3 errors
FAILURE: Build failed with an exception.
* What went wrong:
Execution failed for task ':compileJava' (registered by plugin class 'org.gradle.api.plugins.JavaBasePlugin').
> Compilation failed; see the compiler output below.
/storage/aboba/evovis-client/src/main/java/defpackage/vd.java:585: error: variable var2f is already defined in method onRender(fs)
final aru var2f = var2;
^
3 errors
* Try:
> Check your code and dependencies to fix the compilation error(s)
> Run with --scan to get full insights from a Build Scan (powered by Develocity).
BUILD FAILED in 7s

84
build-logs/vfbuild79.log Normal file
View file

@ -0,0 +1,84 @@
/storage/aboba/evovis-client/src/main/java/defpackage/vp.java:695: error: local variables referenced from a lambda expression must be final or effectively final
var14 = (float)(var9 - var13.start()) / (float)var7;
^
/storage/aboba/evovis-client/src/main/java/defpackage/vp.java:695: error: local variables referenced from a lambda expression must be final or effectively final
var14 = (float)(var9 - var13.start()) / (float)var7;
^
/storage/aboba/evovis-client/src/main/java/defpackage/vp.java:711: error: local variables referenced from a lambda expression must be final or effectively final
if (var20 < var11) {
^
/storage/aboba/evovis-client/src/main/java/defpackage/vp.java:718: error: local variables referenced from a lambda expression must be final or effectively final
var15 = de.EXPO_OUT.ease(var14, 0.0F, 1.0F, 1.0F) * var5;
^
/storage/aboba/evovis-client/src/main/java/defpackage/vp.java:719: error: local variables referenced from a lambda expression must be final or effectively final
var16 = Math.max(0.0F, var15 - var6);
^
/storage/aboba/evovis-client/src/main/java/defpackage/vp.java:720: error: local variables referenced from a lambda expression must be final or effectively final
var17 = withAlpha(var4, 1.0F - var14);
^
/storage/aboba/evovis-client/src/main/java/defpackage/vp.java:731: error: local variables referenced from a lambda expression must be final or effectively final
var21 = (double)var20 / var11 * Math.PI * 2.0;
^
/storage/aboba/evovis-client/src/main/java/defpackage/vp.java:732: error: local variables referenced from a lambda expression must be final or effectively final
var23 = (double)(var20 + (1456913754 | -1456913753) + (1456913754 & -1456913753)) / var11 * Math.PI * 2.0;
^
/storage/aboba/evovis-client/src/main/java/defpackage/vp.java:775: error: local variables referenced from a lambda expression must be final or effectively final
if ((float)(var9 - var4x.start()) / (float)var7 >= 1.0F) {
^
/storage/aboba/evovis-client/src/main/java/defpackage/vp.java:775: error: local variables referenced from a lambda expression must be final or effectively final
if ((float)(var9 - var4x.start()) / (float)var7 >= 1.0F) {
^
/storage/aboba/evovis-client/src/main/java/defpackage/vp.java:964: error: local variables referenced from a lambda expression must be final or effectively final
if (var11 - var4x.start() >= var9) {
^
/storage/aboba/evovis-client/src/main/java/defpackage/vp.java:964: error: local variables referenced from a lambda expression must be final or effectively final
if (var11 - var4x.start() >= var9) {
^
/storage/aboba/evovis-client/src/main/java/defpackage/vp.java:1008: error: local variables referenced from a lambda expression must be final or effectively final
var15x = var11 - var14x.start();
^
/storage/aboba/evovis-client/src/main/java/defpackage/vp.java:1009: error: local variables referenced from a lambda expression must be final or effectively final
var17x = Mth.clamp((float)var15x / (float)var9, 0.0F, 1.0F);
^
/storage/aboba/evovis-client/src/main/java/defpackage/vp.java:1037: error: local variables referenced from a lambda expression must be final or effectively final
var19x = Mth.lerp(de.EXPO_OUT.ease(var17x, 0.0F, 1.0F, 1.0F), 0.15F, var7);
^
/storage/aboba/evovis-client/src/main/java/defpackage/vp.java:1038: error: local variables referenced from a lambda expression must be final or effectively final
var20x = (float)var15x / 1000.0F * (float) (Math.PI * 2) * var8;
^
/storage/aboba/evovis-client/src/main/java/defpackage/vp.java:1044: error: local variables referenced from a lambda expression must be final or effectively final
this.addTextureQuad(var11x, var12, var23, var24, var25, var19x * 1.22F, var21, var22, withAlpha(var5, var18x * 0.45F));
^
/storage/aboba/evovis-client/src/main/java/defpackage/vp.java:1045: error: local variables referenced from a lambda expression must be final or effectively final
this.addTextureQuad(var11x, var12, var23, var24 + 0.002F, var25, var19x, var21, var22, withAlpha(var6, var18x));
^
/storage/aboba/evovis-client/src/main/java/defpackage/vp.java:1127: error: local variables referenced from a lambda expression must be final or effectively final
if (var4 - var2x.start() >= (-361182606506278774L ^ 361182606506280074L) + ((-361182606506278774L & 361182606506280074L) << 1)) {
^
/storage/aboba/evovis-client/src/main/java/defpackage/vp.java:1190: error: local variables referenced from a lambda expression must be final or effectively final
var11 = var4 - var10x.start();
^
/storage/aboba/evovis-client/src/main/java/defpackage/vp.java:1205: error: local variables referenced from a lambda expression must be final or effectively final
var14 = var6 * ringScale(var11);
^
Note: Some input files use or override a deprecated API.
Note: Recompile with -Xlint:deprecation for details.
Note: Some input files use unchecked or unsafe operations.
Note: Recompile with -Xlint:unchecked for details.
21 errors
FAILURE: Build failed with an exception.
* What went wrong:
Execution failed for task ':compileJava' (registered by plugin class 'org.gradle.api.plugins.JavaBasePlugin').
> Compilation failed; see the compiler output below.
/storage/aboba/evovis-client/src/main/java/defpackage/vp.java:695: error: local variables referenced from a lambda expression must be final or effectively final
var14 = (float)(var9 - var13.start()) / (float)var7;
^
21 errors
* Try:
> Check your code and dependencies to fix the compilation error(s)
> Run with --scan to get full insights from a Build Scan (powered by Develocity).
BUILD FAILED in 7s

24
build-logs/vfbuild80.log Normal file
View file

@ -0,0 +1,24 @@
/storage/aboba/evovis-client/src/main/java/defpackage/vu.java:634: error: local variables referenced from a lambda expression must be final or effectively final
if (!var4.equals(this.offerNick)) {
^
Note: Some input files use or override a deprecated API.
Note: Recompile with -Xlint:deprecation for details.
Note: Some input files use unchecked or unsafe operations.
Note: Recompile with -Xlint:unchecked for details.
1 error
FAILURE: Build failed with an exception.
* What went wrong:
Execution failed for task ':compileJava' (registered by plugin class 'org.gradle.api.plugins.JavaBasePlugin').
> Compilation failed; see the compiler output below.
/storage/aboba/evovis-client/src/main/java/defpackage/vu.java:634: error: local variables referenced from a lambda expression must be final or effectively final
if (!var4.equals(this.offerNick)) {
^
1 error
* Try:
> Check your code and dependencies to fix the compilation error(s)
> Run with --scan to get full insights from a Build Scan (powered by Develocity).
BUILD FAILED in 30s

28
build-logs/vfbuild81.log Normal file
View file

@ -0,0 +1,28 @@
/storage/aboba/evovis-client/src/main/java/defpackage/vu.java:634: error: cannot find symbol
if (!var4f.equals(this.offerNick)) {
^
symbol: variable var4f
location: class vu
Note: Some input files use or override a deprecated API.
Note: Recompile with -Xlint:deprecation for details.
Note: Some input files use unchecked or unsafe operations.
Note: Recompile with -Xlint:unchecked for details.
1 error
FAILURE: Build failed with an exception.
* What went wrong:
Execution failed for task ':compileJava' (registered by plugin class 'org.gradle.api.plugins.JavaBasePlugin').
> Compilation failed; see the compiler output below.
/storage/aboba/evovis-client/src/main/java/defpackage/vu.java:634: error: cannot find symbol
if (!var4f.equals(this.offerNick)) {
^
symbol: variable var4f
location: class vu
1 error
* Try:
> Check your code and dependencies to fix the compilation error(s)
> Run with --scan to get full insights from a Build Scan (powered by Develocity).
BUILD FAILED in 9s

33
build-logs/vfbuild82.log Normal file
View file

@ -0,0 +1,33 @@
/storage/aboba/evovis-client/src/main/java/defpackage/wb.java:259: error: local variables referenced from a lambda expression must be final or effectively final
}).anyMatch(var2x -> var2x.getBoundingBox().inflate(0.25).intersects(var8, var9))) ? 1 : 0;
^
/storage/aboba/evovis-client/src/main/java/defpackage/wb.java:259: error: local variables referenced from a lambda expression must be final or effectively final
}).anyMatch(var2x -> var2x.getBoundingBox().inflate(0.25).intersects(var8, var9))) ? 1 : 0;
^
/storage/aboba/evovis-client/src/main/java/defpackage/wb.java:726: error: local variables referenced from a lambda expression must be final or effectively final
}).anyMatch(var2x -> var2x.getBoundingBox().inflate(0.3).intersects(var7, var8))) {
^
/storage/aboba/evovis-client/src/main/java/defpackage/wb.java:726: error: local variables referenced from a lambda expression must be final or effectively final
}).anyMatch(var2x -> var2x.getBoundingBox().inflate(0.3).intersects(var7, var8))) {
^
Note: Some input files use or override a deprecated API.
Note: Recompile with -Xlint:deprecation for details.
Note: Some input files use unchecked or unsafe operations.
Note: Recompile with -Xlint:unchecked for details.
4 errors
FAILURE: Build failed with an exception.
* What went wrong:
Execution failed for task ':compileJava' (registered by plugin class 'org.gradle.api.plugins.JavaBasePlugin').
> Compilation failed; see the compiler output below.
/storage/aboba/evovis-client/src/main/java/defpackage/wb.java:259: error: local variables referenced from a lambda expression must be final or effectively final
}).anyMatch(var2x -> var2x.getBoundingBox().inflate(0.25).intersects(var8, var9))) ? 1 : 0;
^
4 errors
* Try:
> Check your code and dependencies to fix the compilation error(s)
> Run with --scan to get full insights from a Build Scan (powered by Develocity).
BUILD FAILED in 9s

63
build-logs/vfbuild83.log Normal file
View file

@ -0,0 +1,63 @@
/storage/aboba/evovis-client/src/main/java/defpackage/wg.java:880: error: local variables referenced from a lambda expression must be final or effectively final
this.emitCrescents(var16x, var14, var16 * (1.0F + var17x * 0.35F * var24), 0.13F / var17x, var21, var22, var23);
^
/storage/aboba/evovis-client/src/main/java/defpackage/wg.java:880: error: local variables referenced from a lambda expression must be final or effectively final
this.emitCrescents(var16x, var14, var16 * (1.0F + var17x * 0.35F * var24), 0.13F / var17x, var21, var22, var23);
^
/storage/aboba/evovis-client/src/main/java/defpackage/wg.java:880: error: local variables referenced from a lambda expression must be final or effectively final
this.emitCrescents(var16x, var14, var16 * (1.0F + var17x * 0.35F * var24), 0.13F / var17x, var21, var22, var23);
^
/storage/aboba/evovis-client/src/main/java/defpackage/wg.java:880: error: local variables referenced from a lambda expression must be final or effectively final
this.emitCrescents(var16x, var14, var16 * (1.0F + var17x * 0.35F * var24), 0.13F / var17x, var21, var22, var23);
^
/storage/aboba/evovis-client/src/main/java/defpackage/wg.java:880: error: local variables referenced from a lambda expression must be final or effectively final
this.emitCrescents(var16x, var14, var16 * (1.0F + var17x * 0.35F * var24), 0.13F / var17x, var21, var22, var23);
^
/storage/aboba/evovis-client/src/main/java/defpackage/wg.java:880: error: local variables referenced from a lambda expression must be final or effectively final
this.emitCrescents(var16x, var14, var16 * (1.0F + var17x * 0.35F * var24), 0.13F / var17x, var21, var22, var23);
^
/storage/aboba/evovis-client/src/main/java/defpackage/wg.java:885: error: local variables referenced from a lambda expression must be final or effectively final
if (var24 > 0.0F) {
^
/storage/aboba/evovis-client/src/main/java/defpackage/wg.java:900: error: local variables referenced from a lambda expression must be final or effectively final
this.scratch.set(var15x.pose()).translate((float)var3, (float)var17, (float)var7).rotateY(-var12).rotateX(var13);
^
/storage/aboba/evovis-client/src/main/java/defpackage/wg.java:905: error: local variables referenced from a lambda expression must be final or effectively final
this.emitCrescents(var16x, var14, var16, 1.0F, var21, var22, var23);
^
/storage/aboba/evovis-client/src/main/java/defpackage/wg.java:905: error: local variables referenced from a lambda expression must be final or effectively final
this.emitCrescents(var16x, var14, var16, 1.0F, var21, var22, var23);
^
/storage/aboba/evovis-client/src/main/java/defpackage/wg.java:905: error: local variables referenced from a lambda expression must be final or effectively final
this.emitCrescents(var16x, var14, var16, 1.0F, var21, var22, var23);
^
/storage/aboba/evovis-client/src/main/java/defpackage/wg.java:905: error: local variables referenced from a lambda expression must be final or effectively final
this.emitCrescents(var16x, var14, var16, 1.0F, var21, var22, var23);
^
/storage/aboba/evovis-client/src/main/java/defpackage/wg.java:905: error: local variables referenced from a lambda expression must be final or effectively final
this.emitCrescents(var16x, var14, var16, 1.0F, var21, var22, var23);
^
/storage/aboba/evovis-client/src/main/java/defpackage/wg.java:1314: error: local variables referenced from a lambda expression must be final or effectively final
asu.getRGBWithAlpha(var11, this.pulses[var14x] * var15)
^
Note: Some input files use or override a deprecated API.
Note: Recompile with -Xlint:deprecation for details.
Note: Some input files use unchecked or unsafe operations.
Note: Recompile with -Xlint:unchecked for details.
14 errors
FAILURE: Build failed with an exception.
* What went wrong:
Execution failed for task ':compileJava' (registered by plugin class 'org.gradle.api.plugins.JavaBasePlugin').
> Compilation failed; see the compiler output below.
/storage/aboba/evovis-client/src/main/java/defpackage/wg.java:880: error: local variables referenced from a lambda expression must be final or effectively final
this.emitCrescents(var16x, var14, var16 * (1.0F + var17x * 0.35F * var24), 0.13F / var17x, var21, var22, var23);
^
14 errors
* Try:
> Check your code and dependencies to fix the compilation error(s)
> Run with --scan to get full insights from a Build Scan (powered by Develocity).
BUILD FAILED in 8s

27
build-logs/vfbuild84.log Normal file
View file

@ -0,0 +1,27 @@
/storage/aboba/evovis-client/src/main/java/defpackage/wu.java:91: error: local variables referenced from a lambda expression must be final or effectively final
.withClickEvent(new Custom(CLICK_ID, Optional.of(StringTag.valueOf(var2))))
^
/storage/aboba/evovis-client/src/main/java/defpackage/wu.java:92: error: local variables referenced from a lambda expression must be final or effectively final
.withHoverEvent(new ShowText(var5))
^
Note: Some input files use or override a deprecated API.
Note: Recompile with -Xlint:deprecation for details.
Note: Some input files use unchecked or unsafe operations.
Note: Recompile with -Xlint:unchecked for details.
2 errors
FAILURE: Build failed with an exception.
* What went wrong:
Execution failed for task ':compileJava' (registered by plugin class 'org.gradle.api.plugins.JavaBasePlugin').
> Compilation failed; see the compiler output below.
/storage/aboba/evovis-client/src/main/java/defpackage/wu.java:91: error: local variables referenced from a lambda expression must be final or effectively final
.withClickEvent(new Custom(CLICK_ID, Optional.of(StringTag.valueOf(var2))))
^
2 errors
* Try:
> Check your code and dependencies to fix the compilation error(s)
> Run with --scan to get full insights from a Build Scan (powered by Develocity).
BUILD FAILED in 8s

33
build-logs/vfbuild85.log Normal file
View file

@ -0,0 +1,33 @@
/storage/aboba/evovis-client/src/main/java/defpackage/wu.java:92: error: cannot find symbol
.withHoverEvent(new ShowText(var5f))
^
symbol: variable var5f
location: class wu
/storage/aboba/evovis-client/src/main/java/defpackage/wu.java:91: error: cannot find symbol
.withClickEvent(new Custom(CLICK_ID, Optional.of(StringTag.valueOf(var2f))))
^
symbol: variable var2f
location: class wu
Note: Some input files use or override a deprecated API.
Note: Recompile with -Xlint:deprecation for details.
Note: Some input files use unchecked or unsafe operations.
Note: Recompile with -Xlint:unchecked for details.
2 errors
FAILURE: Build failed with an exception.
* What went wrong:
Execution failed for task ':compileJava' (registered by plugin class 'org.gradle.api.plugins.JavaBasePlugin').
> Compilation failed; see the compiler output below.
/storage/aboba/evovis-client/src/main/java/defpackage/wu.java:92: error: cannot find symbol
.withHoverEvent(new ShowText(var5f))
^
symbol: variable var5f
location: class wu
2 errors
* Try:
> Check your code and dependencies to fix the compilation error(s)
> Run with --scan to get full insights from a Build Scan (powered by Develocity).
BUILD FAILED in 8s

24
build-logs/vfbuild86.log Normal file
View file

@ -0,0 +1,24 @@
/storage/aboba/evovis-client/src/main/java/defpackage/wy.java:340: error: local variables referenced from a lambda expression must be final or effectively final
var10000.applySharedCode(var2, String.format(var10002, var10003));
^
Note: Some input files use or override a deprecated API.
Note: Recompile with -Xlint:deprecation for details.
Note: Some input files use unchecked or unsafe operations.
Note: Recompile with -Xlint:unchecked for details.
1 error
FAILURE: Build failed with an exception.
* What went wrong:
Execution failed for task ':compileJava' (registered by plugin class 'org.gradle.api.plugins.JavaBasePlugin').
> Compilation failed; see the compiler output below.
/storage/aboba/evovis-client/src/main/java/defpackage/wy.java:340: error: local variables referenced from a lambda expression must be final or effectively final
var10000.applySharedCode(var2, String.format(var10002, var10003));
^
1 error
* Try:
> Check your code and dependencies to fix the compilation error(s)
> Run with --scan to get full insights from a Build Scan (powered by Develocity).
BUILD FAILED in 7s

24
build-logs/vfbuild87.log Normal file
View file

@ -0,0 +1,24 @@
/storage/aboba/evovis-client/src/main/java/defpackage/zz.java:456: error: local variables referenced from a lambda expression must be final or effectively final
return (float)(cardHeaderHeight() + this.settings.stream().filter(aay::isVisible).mapToDouble(var1x -> var1x.getHeight() + var1).sum() + var1);
^
Note: Some input files use or override a deprecated API.
Note: Recompile with -Xlint:deprecation for details.
Note: Some input files use unchecked or unsafe operations.
Note: Recompile with -Xlint:unchecked for details.
1 error
FAILURE: Build failed with an exception.
* What went wrong:
Execution failed for task ':compileJava' (registered by plugin class 'org.gradle.api.plugins.JavaBasePlugin').
> Compilation failed; see the compiler output below.
/storage/aboba/evovis-client/src/main/java/defpackage/zz.java:456: error: local variables referenced from a lambda expression must be final or effectively final
return (float)(cardHeaderHeight() + this.settings.stream().filter(aay::isVisible).mapToDouble(var1x -> var1x.getHeight() + var1).sum() + var1);
^
1 error
* Try:
> Check your code and dependencies to fix the compilation error(s)
> Run with --scan to get full insights from a Build Scan (powered by Develocity).
BUILD FAILED in 8s

4
build-logs/vfbuild88.log Normal file
View file

@ -0,0 +1,4 @@
Note: Some input files use or override a deprecated API.
Note: Recompile with -Xlint:deprecation for details.
Note: Some input files use unchecked or unsafe operations.
Note: Recompile with -Xlint:unchecked for details.

260
build-logs/vfbuild89.log Normal file

File diff suppressed because one or more lines are too long

4466
build-logs/vfbuild90.log Normal file

File diff suppressed because it is too large Load diff

4
build-logs/vfbuild91.log Normal file
View file

@ -0,0 +1,4 @@
Note: Some input files use or override a deprecated API.
Note: Recompile with -Xlint:deprecation for details.
Note: Some input files use unchecked or unsafe operations.
Note: Recompile with -Xlint:unchecked for details.

849
build-logs/vfbuild92.log Normal file
View file

@ -0,0 +1,849 @@
/storage/aboba/evovis-client/src/main/java/defpackage/yt.java:98: error: illegal forward reference
LABELS.put(nr.MONOCHROME, "Mono");
^
/storage/aboba/evovis-client/src/main/java/defpackage/yt.java:99: error: illegal forward reference
LABELS.put(nr.ANALOGOUS, "Analog");
^
/storage/aboba/evovis-client/src/main/java/defpackage/yt.java:100: error: illegal forward reference
LABELS.put(nr.COMPLEMENT, "Opposite");
^
/storage/aboba/evovis-client/src/main/java/defpackage/yt.java:101: error: illegal forward reference
LABELS.put(nr.TRIAD, "Triad");
^
/storage/aboba/evovis-client/src/main/java/defpackage/yt.java:102: error: illegal forward reference
LABELS.put(nr.SPLIT, "Split");
^
/storage/aboba/evovis-client/src/main/java/defpackage/yt.java:103: error: illegal forward reference
LABELS.put(nr.CUSTOM, "Free");
^
/storage/aboba/evovis-client/src/main/java/defpackage/yt.java:104: error: illegal forward reference
TOOLTIPS.put(
^
/storage/aboba/evovis-client/src/main/java/defpackage/yt.java:108: error: illegal forward reference
TOOLTIPS.put(
^
/storage/aboba/evovis-client/src/main/java/defpackage/yt.java:112: error: illegal forward reference
TOOLTIPS.put(
^
/storage/aboba/evovis-client/src/main/java/defpackage/yt.java:116: error: illegal forward reference
TOOLTIPS.put(
^
/storage/aboba/evovis-client/src/main/java/defpackage/yt.java:119: error: illegal forward reference
TOOLTIPS.put(
^
/storage/aboba/evovis-client/src/main/java/defpackage/yt.java:123: error: illegal forward reference
TOOLTIPS.put(
^
/storage/aboba/evovis-client/src/main/java/defpackage/yr.java:991: error: illegal forward reference
var7[0] = GOOD;
^
/storage/aboba/evovis-client/src/main/java/defpackage/yr.java:992: error: illegal forward reference
var7[1] = WARN;
^
/storage/aboba/evovis-client/src/main/java/defpackage/yr.java:993: error: illegal forward reference
var7[2] = BAD;
^
/storage/aboba/evovis-client/src/main/java/defpackage/yy.java:445: error: illegal forward reference
NAMES.put(nx.BACKGROUND, "Window");
^
/storage/aboba/evovis-client/src/main/java/defpackage/yy.java:446: error: illegal forward reference
NAMES.put(nx.SURFACE, "Panels");
^
/storage/aboba/evovis-client/src/main/java/defpackage/yy.java:447: error: illegal forward reference
NAMES.put(nx.SURFACE_RAISED, "Raised cards");
^
/storage/aboba/evovis-client/src/main/java/defpackage/yy.java:448: error: illegal forward reference
NAMES.put(nx.SURFACE_SUNKEN, "Card bodies");
^
/storage/aboba/evovis-client/src/main/java/defpackage/yy.java:449: error: illegal forward reference
NAMES.put(nx.SURFACE_MUTED, "Inactive");
^
/storage/aboba/evovis-client/src/main/java/defpackage/yy.java:450: error: illegal forward reference
NAMES.put(nx.ON_SURFACE, "Main text");
^
/storage/aboba/evovis-client/src/main/java/defpackage/yy.java:451: error: illegal forward reference
NAMES.put(nx.ON_SURFACE_MUTED, "Secondary");
^
/storage/aboba/evovis-client/src/main/java/defpackage/yy.java:452: error: illegal forward reference
NAMES.put(nx.ON_SURFACE_FAINT, "Hints");
^
/storage/aboba/evovis-client/src/main/java/defpackage/yy.java:453: error: illegal forward reference
NAMES.put(nx.ICON_INACTIVE, "Icons off");
^
/storage/aboba/evovis-client/src/main/java/defpackage/yy.java:454: error: illegal forward reference
NAMES.put(nx.ACCENT, "Start");
^
/storage/aboba/evovis-client/src/main/java/defpackage/yy.java:455: error: illegal forward reference
NAMES.put(nx.ACCENT_MIDDLE, "Middle");
^
/storage/aboba/evovis-client/src/main/java/defpackage/yy.java:456: error: illegal forward reference
NAMES.put(nx.ACCENT_END, "End");
^
/storage/aboba/evovis-client/src/main/java/defpackage/yy.java:457: error: illegal forward reference
NAMES.put(nx.OUTLINE, "Borders");
^
/storage/aboba/evovis-client/src/main/java/defpackage/yy.java:458: error: illegal forward reference
NAMES.put(nx.OUTLINE_STRONG, "Strong borders");
^
/storage/aboba/evovis-client/src/main/java/defpackage/yy.java:459: error: illegal forward reference
NAMES.put(nx.FRIEND, "Friends");
^
/storage/aboba/evovis-client/src/main/java/defpackage/Cdo.java:11: error: illegal forward reference
$SwitchMap$net$minecraft$world$level$block$Rotation[Rotation.NONE.ordinal()] = 1;
^
/storage/aboba/evovis-client/src/main/java/defpackage/Cdo.java:15: error: illegal forward reference
$SwitchMap$net$minecraft$world$level$block$Rotation[Rotation.CLOCKWISE_90.ordinal()] = 2;
^
/storage/aboba/evovis-client/src/main/java/defpackage/Cdo.java:19: error: illegal forward reference
$SwitchMap$net$minecraft$world$level$block$Rotation[Rotation.CLOCKWISE_180.ordinal()] = 3;
^
/storage/aboba/evovis-client/src/main/java/defpackage/Cdo.java:23: error: illegal forward reference
$SwitchMap$net$minecraft$world$level$block$Rotation[Rotation.COUNTERCLOCKWISE_90.ordinal()] = 4;
^
/storage/aboba/evovis-client/src/main/java/defpackage/aai.java:8: error: illegal forward reference
$SwitchMap$evo$systems$social$InventoryShareService$ViewState[ank.READY.ordinal()] = 1;
^
/storage/aboba/evovis-client/src/main/java/defpackage/aai.java:12: error: illegal forward reference
$SwitchMap$evo$systems$social$InventoryShareService$ViewState[ank.WAITING.ordinal()] = 2;
^
/storage/aboba/evovis-client/src/main/java/defpackage/aai.java:16: error: illegal forward reference
$SwitchMap$evo$systems$social$InventoryShareService$ViewState[ank.LOADING.ordinal()] = 3;
^
/storage/aboba/evovis-client/src/main/java/defpackage/aai.java:20: error: illegal forward reference
$SwitchMap$evo$systems$social$InventoryShareService$ViewState[ank.DENIED.ordinal()] = 4;
^
/storage/aboba/evovis-client/src/main/java/defpackage/aai.java:24: error: illegal forward reference
$SwitchMap$evo$systems$social$InventoryShareService$ViewState[ank.FAILED.ordinal()] = 5;
^
/storage/aboba/evovis-client/src/main/java/defpackage/aan.java:10: error: illegal forward reference
$SwitchMap$evo$systems$report$ticket$TicketStatus[aku.DELIVERED.ordinal()] = 1;
^
/storage/aboba/evovis-client/src/main/java/defpackage/aan.java:14: error: illegal forward reference
$SwitchMap$evo$systems$report$ticket$TicketStatus[aku.IN_PROGRESS.ordinal()] = 2;
^
/storage/aboba/evovis-client/src/main/java/defpackage/aan.java:18: error: illegal forward reference
$SwitchMap$evo$systems$report$ticket$TicketStatus[aku.CLOSED.ordinal()] = 3;
^
/storage/aboba/evovis-client/src/main/java/defpackage/abt.java:8: error: illegal forward reference
$SwitchMap$evo$systems$client$modules$api$setting$impl$ActionGridSetting$ListEntry$Kind[rr.SECTION.ordinal()] = 1;
^
/storage/aboba/evovis-client/src/main/java/defpackage/abt.java:12: error: illegal forward reference
$SwitchMap$evo$systems$client$modules$api$setting$impl$ActionGridSetting$ListEntry$Kind[rr.NOTE.ordinal()] = 2;
^
/storage/aboba/evovis-client/src/main/java/defpackage/abt.java:16: error: illegal forward reference
$SwitchMap$evo$systems$client$modules$api$setting$impl$ActionGridSetting$ListEntry$Kind[rr.ACTION.ordinal()] = 3;
^
/storage/aboba/evovis-client/src/main/java/defpackage/abv.java:8: error: illegal forward reference
$SwitchMap$evo$systems$replay$ReplayStatus$Kind[ajo.RECORDING.ordinal()] = 1;
^
/storage/aboba/evovis-client/src/main/java/defpackage/abv.java:12: error: illegal forward reference
$SwitchMap$evo$systems$replay$ReplayStatus$Kind[ajo.EXPORTING.ordinal()] = 2;
^
/storage/aboba/evovis-client/src/main/java/defpackage/abv.java:16: error: illegal forward reference
$SwitchMap$evo$systems$replay$ReplayStatus$Kind[ajo.TUNING.ordinal()] = 3;
^
/storage/aboba/evovis-client/src/main/java/defpackage/acm.java:8: error: illegal forward reference
$SwitchMap$evo$systems$client$screens$title$MainMenuSection[acq.PRIMARY.ordinal()] = 1;
^
/storage/aboba/evovis-client/src/main/java/defpackage/acm.java:12: error: illegal forward reference
$SwitchMap$evo$systems$client$screens$title$MainMenuSection[acq.EXTRAS.ordinal()] = 2;
^
/storage/aboba/evovis-client/src/main/java/defpackage/acm.java:16: error: illegal forward reference
$SwitchMap$evo$systems$client$screens$title$MainMenuSection[acq.MODS.ordinal()] = 3;
^
/storage/aboba/evovis-client/src/main/java/defpackage/acm.java:20: error: illegal forward reference
$SwitchMap$evo$systems$client$screens$title$MainMenuSection[acq.ICONS.ordinal()] = 4;
^
/storage/aboba/evovis-client/src/main/java/defpackage/acm.java:24: error: illegal forward reference
$SwitchMap$evo$systems$client$screens$title$MainMenuSection[acq.CORNER.ordinal()] = 5;
^
/storage/aboba/evovis-client/src/main/java/defpackage/acm.java:28: error: illegal forward reference
$SwitchMap$evo$systems$client$screens$title$MainMenuSection[acq.FOOTER.ordinal()] = 6;
^
/storage/aboba/evovis-client/src/main/java/defpackage/adl.java:336: error: illegal forward reference
BACKPACKS.add(
^
/storage/aboba/evovis-client/src/main/java/defpackage/adl.java:342: error: illegal forward reference
BACKPACKS.add(
^
/storage/aboba/evovis-client/src/main/java/defpackage/adl.java:348: error: illegal forward reference
BACKPACKS.add(
^
/storage/aboba/evovis-client/src/main/java/defpackage/adl.java:354: error: illegal forward reference
BACKPACKS.add(
^
/storage/aboba/evovis-client/src/main/java/defpackage/adl.java:360: error: illegal forward reference
BACKPACKS.add(
^
/storage/aboba/evovis-client/src/main/java/defpackage/adl.java:366: error: illegal forward reference
BACKPACKS.add(
^
/storage/aboba/evovis-client/src/main/java/defpackage/adl.java:372: error: illegal forward reference
BACKPACKS.add(
^
/storage/aboba/evovis-client/src/main/java/defpackage/adl.java:378: error: illegal forward reference
BACKPACKS.add(
^
/storage/aboba/evovis-client/src/main/java/defpackage/ado.java:429: error: illegal forward reference
CAPES_BY_KEY.put("black_smile", ado::builtinCape);
^
/storage/aboba/evovis-client/src/main/java/defpackage/ado.java:430: error: illegal forward reference
CAPES_BY_KEY.put("sunset", ado::sunsetCape);
^
/storage/aboba/evovis-client/src/main/java/defpackage/ado.java:431: error: illegal forward reference
CAPES_BY_KEY.put("nebula", ado::nebulaCape);
^
/storage/aboba/evovis-client/src/main/java/defpackage/ado.java:432: error: illegal forward reference
CAPES_BY_KEY.put("phantom", ado::skinmcCape);
^
/storage/aboba/evovis-client/src/main/java/defpackage/ado.java:433: error: illegal forward reference
CAPES_BY_KEY.put("cosmos", ado::cosmosCape);
^
/storage/aboba/evovis-client/src/main/java/defpackage/ado.java:434: error: illegal forward reference
CAPES_BY_KEY.put("holy", ado::holyCape);
^
/storage/aboba/evovis-client/src/main/java/defpackage/ado.java:435: error: illegal forward reference
CAPES_BY_KEY.put("dancing_cat", ado::dancingCatCape);
^
/storage/aboba/evovis-client/src/main/java/defpackage/adw.java:8: error: illegal forward reference
$SwitchMap$evo$systems$cosmetic$CosmeticShowcase$Slot[aec.CAPES.ordinal()] = 1;
^
/storage/aboba/evovis-client/src/main/java/defpackage/adw.java:12: error: illegal forward reference
$SwitchMap$evo$systems$cosmetic$CosmeticShowcase$Slot[aec.WINGS.ordinal()] = 2;
^
/storage/aboba/evovis-client/src/main/java/defpackage/adw.java:16: error: illegal forward reference
$SwitchMap$evo$systems$cosmetic$CosmeticShowcase$Slot[aec.BACKPACKS.ordinal()] = 3;
^
/storage/aboba/evovis-client/src/main/java/defpackage/adw.java:20: error: illegal forward reference
$SwitchMap$evo$systems$cosmetic$CosmeticShowcase$Slot[aec.NAMETAGS.ordinal()] = 4;
^
/storage/aboba/evovis-client/src/main/java/defpackage/adw.java:24: error: illegal forward reference
$SwitchMap$evo$systems$cosmetic$CosmeticShowcase$Slot[aec.MELEE.ordinal()] = 5;
^
/storage/aboba/evovis-client/src/main/java/defpackage/ady.java:8: error: illegal forward reference
$SwitchMap$evo$systems$cosmetic$AttachmentPoint[adj.HEAD.ordinal()] = 1;
^
/storage/aboba/evovis-client/src/main/java/defpackage/ady.java:12: error: illegal forward reference
$SwitchMap$evo$systems$cosmetic$AttachmentPoint[adj.ABOVE_HEAD.ordinal()] = 2;
^
/storage/aboba/evovis-client/src/main/java/defpackage/ady.java:16: error: illegal forward reference
$SwitchMap$evo$systems$cosmetic$AttachmentPoint[adj.BODY.ordinal()] = 3;
^
/storage/aboba/evovis-client/src/main/java/defpackage/ady.java:20: error: illegal forward reference
$SwitchMap$evo$systems$cosmetic$AttachmentPoint[adj.RIGHT_ARM.ordinal()] = 4;
^
/storage/aboba/evovis-client/src/main/java/defpackage/ady.java:24: error: illegal forward reference
$SwitchMap$evo$systems$cosmetic$AttachmentPoint[adj.LEFT_ARM.ordinal()] = 5;
^
/storage/aboba/evovis-client/src/main/java/defpackage/ady.java:28: error: illegal forward reference
$SwitchMap$evo$systems$cosmetic$AttachmentPoint[adj.RIGHT_LEG.ordinal()] = 6;
^
/storage/aboba/evovis-client/src/main/java/defpackage/ady.java:32: error: illegal forward reference
$SwitchMap$evo$systems$cosmetic$AttachmentPoint[adj.LEFT_LEG.ordinal()] = 7;
^
/storage/aboba/evovis-client/src/main/java/defpackage/aey.java:423: error: illegal forward reference
SKINS.add(
^
/storage/aboba/evovis-client/src/main/java/defpackage/aey.java:429: error: illegal forward reference
SKINS.add(
^
/storage/aboba/evovis-client/src/main/java/defpackage/aey.java:435: error: illegal forward reference
SKINS.add(
^
/storage/aboba/evovis-client/src/main/java/defpackage/aey.java:442: error: illegal forward reference
SKINS.add(
^
/storage/aboba/evovis-client/src/main/java/defpackage/aey.java:448: error: illegal forward reference
List var3 = SKINS;
^
/storage/aboba/evovis-client/src/main/java/defpackage/aey.java:459: error: illegal forward reference
SKINS.add(
^
/storage/aboba/evovis-client/src/main/java/defpackage/aey.java:466: error: illegal forward reference
List var4 = SKINS;
^
/storage/aboba/evovis-client/src/main/java/defpackage/aey.java:477: error: illegal forward reference
List var5 = SKINS;
^
/storage/aboba/evovis-client/src/main/java/defpackage/aey.java:488: error: illegal forward reference
SKINS.add(
^
/storage/aboba/evovis-client/src/main/java/defpackage/aey.java:494: error: illegal forward reference
SKINS.add(
^
/storage/aboba/evovis-client/src/main/java/defpackage/aey.java:501: error: illegal forward reference
SKINS.add(
^
/storage/aboba/evovis-client/src/main/java/defpackage/aey.java:504: error: illegal forward reference
List var6 = SKINS;
^
/storage/aboba/evovis-client/src/main/java/defpackage/aey.java:515: error: illegal forward reference
List var7 = SKINS;
^
/storage/aboba/evovis-client/src/main/java/defpackage/aey.java:526: error: illegal forward reference
SKINS.add(
^
/storage/aboba/evovis-client/src/main/java/defpackage/aey.java:532: error: illegal forward reference
List var8 = SKINS;
^
/storage/aboba/evovis-client/src/main/java/defpackage/aey.java:543: error: illegal forward reference
SKINS.add(
^
/storage/aboba/evovis-client/src/main/java/defpackage/aey.java:549: error: illegal forward reference
List var9 = SKINS;
^
/storage/aboba/evovis-client/src/main/java/defpackage/aey.java:560: error: illegal forward reference
SKINS.add(
^
/storage/aboba/evovis-client/src/main/java/defpackage/afe.java:19: error: illegal forward reference
private static final List<afd> WING_CATALOG = Collections.unmodifiableList(WINGS);
^
/storage/aboba/evovis-client/src/main/java/defpackage/afe.java:579: error: illegal forward reference
WINGS.add(
^
/storage/aboba/evovis-client/src/main/java/defpackage/afe.java:586: error: illegal forward reference
WINGS.add(
^
/storage/aboba/evovis-client/src/main/java/defpackage/afe.java:593: error: illegal forward reference
WINGS.add(
^
/storage/aboba/evovis-client/src/main/java/defpackage/afe.java:600: error: illegal forward reference
WINGS.add(
^
/storage/aboba/evovis-client/src/main/java/defpackage/afe.java:607: error: illegal forward reference
WINGS.add(
^
/storage/aboba/evovis-client/src/main/java/defpackage/afe.java:614: error: illegal forward reference
WINGS.add(
^
/storage/aboba/evovis-client/src/main/java/defpackage/afe.java:621: error: illegal forward reference
WINGS.add(
^
/storage/aboba/evovis-client/src/main/java/defpackage/afe.java:628: error: illegal forward reference
WINGS.add(
^
/storage/aboba/evovis-client/src/main/java/defpackage/afe.java:635: error: illegal forward reference
WINGS.add(
^
/storage/aboba/evovis-client/src/main/java/defpackage/afe.java:642: error: illegal forward reference
WINGS.add(
^
/storage/aboba/evovis-client/src/main/java/defpackage/afe.java:649: error: illegal forward reference
WINGS.add(
^
/storage/aboba/evovis-client/src/main/java/defpackage/afe.java:656: error: illegal forward reference
WINGS.add(
^
/storage/aboba/evovis-client/src/main/java/defpackage/afe.java:663: error: illegal forward reference
WINGS.add(
^
/storage/aboba/evovis-client/src/main/java/defpackage/afe.java:670: error: illegal forward reference
WINGS.add(
^
/storage/aboba/evovis-client/src/main/java/defpackage/afg.java:8: error: illegal forward reference
$SwitchMap$evo$systems$cosmetic$camera$CameraGear[aff.CAMERA.ordinal()] = 1;
^
/storage/aboba/evovis-client/src/main/java/defpackage/afg.java:12: error: illegal forward reference
$SwitchMap$evo$systems$cosmetic$camera$CameraGear[aff.TRIPOD.ordinal()] = 2;
^
/storage/aboba/evovis-client/src/main/java/defpackage/afg.java:16: error: illegal forward reference
$SwitchMap$evo$systems$cosmetic$camera$CameraGear[aff.PHOTO.ordinal()] = 3;
^
/storage/aboba/evovis-client/src/main/java/defpackage/afg.java:20: error: illegal forward reference
$SwitchMap$evo$systems$cosmetic$camera$CameraGear[aff.NONE.ordinal()] = 4;
^
/storage/aboba/evovis-client/src/main/java/defpackage/afl.java:8: error: illegal forward reference
$SwitchMap$evo$systems$cosmetic$camera$CameraGear[aff.CAMERA.ordinal()] = 1;
^
/storage/aboba/evovis-client/src/main/java/defpackage/afl.java:12: error: illegal forward reference
$SwitchMap$evo$systems$cosmetic$camera$CameraGear[aff.TRIPOD.ordinal()] = 2;
^
/storage/aboba/evovis-client/src/main/java/defpackage/afl.java:16: error: illegal forward reference
$SwitchMap$evo$systems$cosmetic$camera$CameraGear[aff.PHOTO.ordinal()] = 3;
^
/storage/aboba/evovis-client/src/main/java/defpackage/afl.java:20: error: illegal forward reference
$SwitchMap$evo$systems$cosmetic$camera$CameraGear[aff.NONE.ordinal()] = 4;
^
/storage/aboba/evovis-client/src/main/java/defpackage/afq.java:8: error: illegal forward reference
$SwitchMap$evo$systems$cosmetic$camera$CameraSession$Placement[aft.READY.ordinal()] = 1;
^
/storage/aboba/evovis-client/src/main/java/defpackage/afq.java:12: error: illegal forward reference
$SwitchMap$evo$systems$cosmetic$camera$CameraSession$Placement[aft.BLOCKED.ordinal()] = 2;
^
/storage/aboba/evovis-client/src/main/java/defpackage/afq.java:16: error: illegal forward reference
$SwitchMap$evo$systems$cosmetic$camera$CameraSession$Placement[aft.OCCUPIED.ordinal()] = 3;
^
/storage/aboba/evovis-client/src/main/java/defpackage/afq.java:20: error: illegal forward reference
$SwitchMap$evo$systems$cosmetic$camera$CameraSession$Placement[aft.TOO_MANY.ordinal()] = 4;
^
/storage/aboba/evovis-client/src/main/java/defpackage/afq.java:24: error: illegal forward reference
$SwitchMap$evo$systems$cosmetic$camera$CameraSession$Placement[aft.EMPTY.ordinal()] = 5;
^
/storage/aboba/evovis-client/src/main/java/defpackage/afq.java:28: error: illegal forward reference
$SwitchMap$evo$systems$cosmetic$camera$CameraSession$Placement[aft.NONE.ordinal()] = 6;
^
/storage/aboba/evovis-client/src/main/java/defpackage/alb.java:10: error: illegal forward reference
$SwitchMap$net$minecraft$core$Direction[Direction.UP.ordinal()] = 1;
^
/storage/aboba/evovis-client/src/main/java/defpackage/alb.java:14: error: illegal forward reference
$SwitchMap$net$minecraft$core$Direction[Direction.DOWN.ordinal()] = 2;
^
/storage/aboba/evovis-client/src/main/java/defpackage/alb.java:18: error: illegal forward reference
$SwitchMap$net$minecraft$core$Direction[Direction.NORTH.ordinal()] = 3;
^
/storage/aboba/evovis-client/src/main/java/defpackage/alb.java:22: error: illegal forward reference
$SwitchMap$net$minecraft$core$Direction[Direction.SOUTH.ordinal()] = 4;
^
/storage/aboba/evovis-client/src/main/java/defpackage/ale.java:10: error: illegal forward reference
$SwitchMap$net$minecraft$world$level$block$Rotation[Rotation.NONE.ordinal()] = 1;
^
/storage/aboba/evovis-client/src/main/java/defpackage/ale.java:14: error: illegal forward reference
$SwitchMap$net$minecraft$world$level$block$Rotation[Rotation.CLOCKWISE_90.ordinal()] = 2;
^
/storage/aboba/evovis-client/src/main/java/defpackage/ale.java:18: error: illegal forward reference
$SwitchMap$net$minecraft$world$level$block$Rotation[Rotation.CLOCKWISE_180.ordinal()] = 3;
^
/storage/aboba/evovis-client/src/main/java/defpackage/ale.java:22: error: illegal forward reference
$SwitchMap$net$minecraft$world$level$block$Rotation[Rotation.COUNTERCLOCKWISE_90.ordinal()] = 4;
^
/storage/aboba/evovis-client/src/main/java/defpackage/aly.java:51: error: illegal forward reference
EXP[power] = value;
^
/storage/aboba/evovis-client/src/main/java/defpackage/aly.java:52: error: illegal forward reference
LOG[value] = power;
^
/storage/aboba/evovis-client/src/main/java/defpackage/aly.java:56: error: illegal forward reference
for (int power = 255; power < EXP.length; power++) {
^
/storage/aboba/evovis-client/src/main/java/defpackage/aly.java:57: error: illegal forward reference
EXP[power] = EXP[power - 255];
^
/storage/aboba/evovis-client/src/main/java/defpackage/aly.java:57: error: illegal forward reference
EXP[power] = EXP[power - 255];
^
/storage/aboba/evovis-client/src/main/java/defpackage/aoe.java:8: error: illegal forward reference
$SwitchMap$evo$systems$social$watch$WatchPlayer$Status[aoc.FAILED.ordinal()] = 1;
^
/storage/aboba/evovis-client/src/main/java/defpackage/aoe.java:12: error: illegal forward reference
$SwitchMap$evo$systems$social$watch$WatchPlayer$Status[aoc.ENDED.ordinal()] = 2;
^
/storage/aboba/evovis-client/src/main/java/defpackage/aoe.java:16: error: illegal forward reference
$SwitchMap$evo$systems$social$watch$WatchPlayer$Status[aoc.PLAYING.ordinal()] = 3;
^
/storage/aboba/evovis-client/src/main/java/defpackage/aoe.java:20: error: illegal forward reference
$SwitchMap$evo$systems$social$watch$WatchPlayer$Status[aoc.LOADING.ordinal()] = 4;
^
/storage/aboba/evovis-client/src/main/java/defpackage/aoq.java:734: error: illegal forward reference
ACTIVE_BADGES[var0 - (1)][var1] = createBadge("", var0, var1, TIER_COLORS[var2][var1]);
^
/storage/aboba/evovis-client/src/main/java/defpackage/aoq.java:735: error: illegal forward reference
RETIRED_BADGES[var0 - (1)][var1] = createBadge(
^
/storage/aboba/evovis-client/src/main/java/defpackage/apn.java:10: error: illegal forward reference
$SwitchMap$com$mojang$blaze3d$platform$InputConstants$Type[InputConstants.Type.KEYSYM.ordinal()] = 1;
^
/storage/aboba/evovis-client/src/main/java/defpackage/apn.java:14: error: illegal forward reference
$SwitchMap$com$mojang$blaze3d$platform$InputConstants$Type[InputConstants.Type.MOUSE.ordinal()] = 2;
^
/storage/aboba/evovis-client/src/main/java/defpackage/aqj.java:386: error: illegal forward reference
TRIG_TABLE[var0] = Math.sin(var0 * (Math.PI * 2) / 65536.0);
^
/storage/aboba/evovis-client/src/main/java/defpackage/aqz.java:177: error: illegal forward reference
BY_CODE.put(var3.keyCode, var3);
^
/storage/aboba/evovis-client/src/main/java/defpackage/aqz.java:178: error: illegal forward reference
BY_NAME.put(var3.name.toLowerCase(), var3);
^
/storage/aboba/evovis-client/src/main/java/defpackage/hp.java:8: error: illegal forward reference
$SwitchMap$evo$systems$base$inventory$ItemMoveMode[ho.SINGLE.ordinal()] = 1;
^
/storage/aboba/evovis-client/src/main/java/defpackage/hp.java:12: error: illegal forward reference
$SwitchMap$evo$systems$base$inventory$ItemMoveMode[ho.STACK.ordinal()] = 2;
^
/storage/aboba/evovis-client/src/main/java/defpackage/hp.java:16: error: illegal forward reference
$SwitchMap$evo$systems$base$inventory$ItemMoveMode[ho.MATCHING.ordinal()] = 3;
^
/storage/aboba/evovis-client/src/main/java/defpackage/hp.java:20: error: illegal forward reference
$SwitchMap$evo$systems$base$inventory$ItemMoveMode[ho.EVERYTHING.ordinal()] = 4;
^
/storage/aboba/evovis-client/src/main/java/defpackage/hr.java:10: error: illegal forward reference
$SwitchMap$net$minecraft$world$entity$EquipmentSlot[EquipmentSlot.HEAD.ordinal()] = 1;
^
/storage/aboba/evovis-client/src/main/java/defpackage/hr.java:14: error: illegal forward reference
$SwitchMap$net$minecraft$world$entity$EquipmentSlot[EquipmentSlot.CHEST.ordinal()] = 2;
^
/storage/aboba/evovis-client/src/main/java/defpackage/hr.java:18: error: illegal forward reference
$SwitchMap$net$minecraft$world$entity$EquipmentSlot[EquipmentSlot.LEGS.ordinal()] = 3;
^
/storage/aboba/evovis-client/src/main/java/defpackage/hr.java:22: error: illegal forward reference
$SwitchMap$net$minecraft$world$entity$EquipmentSlot[EquipmentSlot.FEET.ordinal()] = 4;
^
/storage/aboba/evovis-client/src/main/java/defpackage/hx.java:8: error: illegal forward reference
$SwitchMap$evo$systems$base$inventory$SortKey[hv.NAME.ordinal()] = 1;
^
/storage/aboba/evovis-client/src/main/java/defpackage/hx.java:12: error: illegal forward reference
$SwitchMap$evo$systems$base$inventory$SortKey[hv.COUNT.ordinal()] = 2;
^
/storage/aboba/evovis-client/src/main/java/defpackage/hx.java:16: error: illegal forward reference
$SwitchMap$evo$systems$base$inventory$SortKey[hv.RARITY.ordinal()] = 3;
^
/storage/aboba/evovis-client/src/main/java/defpackage/ic.java:8: error: illegal forward reference
$SwitchMap$evo$systems$base$log$EvoLogLevel[ii.TRACE.ordinal()] = 1;
^
/storage/aboba/evovis-client/src/main/java/defpackage/ic.java:12: error: illegal forward reference
$SwitchMap$evo$systems$base$log$EvoLogLevel[ii.DEBUG.ordinal()] = 2;
^
/storage/aboba/evovis-client/src/main/java/defpackage/ic.java:16: error: illegal forward reference
$SwitchMap$evo$systems$base$log$EvoLogLevel[ii.INFO.ordinal()] = 3;
^
/storage/aboba/evovis-client/src/main/java/defpackage/ic.java:20: error: illegal forward reference
$SwitchMap$evo$systems$base$log$EvoLogLevel[ii.WARN.ordinal()] = 4;
^
/storage/aboba/evovis-client/src/main/java/defpackage/ic.java:24: error: illegal forward reference
$SwitchMap$evo$systems$base$log$EvoLogLevel[ii.ERROR.ordinal()] = 5;
^
/storage/aboba/evovis-client/src/main/java/defpackage/in.java:1005: error: illegal forward reference
HANN_WINDOW[var0] = (float)(0.5 * (1.0 - Math.cos((Math.PI * 2) * var0 / 1023.0)));
^
/storage/aboba/evovis-client/src/main/java/defpackage/in.java:1006: error: illegal forward reference
BIT_REVERSED[var0] = computeBitReverse(var0, (825029969 | -825029959) + (825029969 & -825029959));
^
/storage/aboba/evovis-client/src/main/java/defpackage/in.java:1011: error: illegal forward reference
COS_TABLE[var3] = (float)Math.cos(var1);
^
/storage/aboba/evovis-client/src/main/java/defpackage/in.java:1012: error: illegal forward reference
SIN_TABLE[var3] = (float)Math.sin(var1);
^
/storage/aboba/evovis-client/src/main/java/defpackage/io.java:8: error: illegal forward reference
$SwitchMap$evo$systems$base$media$MediaAction[iw.NEXT.ordinal()] = 1;
^
/storage/aboba/evovis-client/src/main/java/defpackage/io.java:12: error: illegal forward reference
$SwitchMap$evo$systems$base$media$MediaAction[iw.PREVIOUS.ordinal()] = 2;
^
/storage/aboba/evovis-client/src/main/java/defpackage/io.java:16: error: illegal forward reference
$SwitchMap$evo$systems$base$media$MediaAction[iw.PLAY_PAUSE.ordinal()] = 3;
^
/storage/aboba/evovis-client/src/main/java/defpackage/ir.java:8: error: illegal forward reference
$SwitchMap$evo$systems$base$media$MediaAction[iw.NEXT.ordinal()] = 1;
^
/storage/aboba/evovis-client/src/main/java/defpackage/ir.java:12: error: illegal forward reference
$SwitchMap$evo$systems$base$media$MediaAction[iw.PREVIOUS.ordinal()] = 2;
^
/storage/aboba/evovis-client/src/main/java/defpackage/ir.java:16: error: illegal forward reference
$SwitchMap$evo$systems$base$media$MediaAction[iw.PLAY_PAUSE.ordinal()] = 3;
^
/storage/aboba/evovis-client/src/main/java/defpackage/it.java:8: error: illegal forward reference
$SwitchMap$evo$systems$base$media$MediaAction[iw.NEXT.ordinal()] = 1;
^
/storage/aboba/evovis-client/src/main/java/defpackage/it.java:12: error: illegal forward reference
$SwitchMap$evo$systems$base$media$MediaAction[iw.PREVIOUS.ordinal()] = 2;
^
/storage/aboba/evovis-client/src/main/java/defpackage/it.java:16: error: illegal forward reference
$SwitchMap$evo$systems$base$media$MediaAction[iw.PLAY_PAUSE.ordinal()] = 3;
^
/storage/aboba/evovis-client/src/main/java/defpackage/jq.java:8: error: illegal forward reference
$SwitchMap$evo$systems$base$media$MediaAction[iw.NEXT.ordinal()] = 1;
^
/storage/aboba/evovis-client/src/main/java/defpackage/jq.java:12: error: illegal forward reference
$SwitchMap$evo$systems$base$media$MediaAction[iw.PREVIOUS.ordinal()] = 2;
^
/storage/aboba/evovis-client/src/main/java/defpackage/jq.java:16: error: illegal forward reference
$SwitchMap$evo$systems$base$media$MediaAction[iw.PLAY_PAUSE.ordinal()] = 3;
^
/storage/aboba/evovis-client/src/main/java/defpackage/ju.java:8: error: illegal forward reference
$SwitchMap$evo$systems$base$media$MediaAction[iw.NEXT.ordinal()] = 1;
^
/storage/aboba/evovis-client/src/main/java/defpackage/ju.java:12: error: illegal forward reference
$SwitchMap$evo$systems$base$media$MediaAction[iw.PREVIOUS.ordinal()] = 2;
^
/storage/aboba/evovis-client/src/main/java/defpackage/ju.java:16: error: illegal forward reference
$SwitchMap$evo$systems$base$media$MediaAction[iw.PLAY_PAUSE.ordinal()] = 3;
^
/storage/aboba/evovis-client/src/main/java/defpackage/jw.java:8: error: illegal forward reference
$SwitchMap$evo$systems$base$media$MediaAction[iw.NEXT.ordinal()] = 1;
^
/storage/aboba/evovis-client/src/main/java/defpackage/jw.java:12: error: illegal forward reference
$SwitchMap$evo$systems$base$media$MediaAction[iw.PREVIOUS.ordinal()] = 2;
^
/storage/aboba/evovis-client/src/main/java/defpackage/jw.java:16: error: illegal forward reference
$SwitchMap$evo$systems$base$media$MediaAction[iw.PLAY_PAUSE.ordinal()] = 3;
^
/storage/aboba/evovis-client/src/main/java/defpackage/ln.java:8: error: illegal forward reference
$SwitchMap$evo$systems$base$rotation$mods$config$api$RotationModeType[mh.INSTANT.ordinal()] = 1;
^
/storage/aboba/evovis-client/src/main/java/defpackage/ln.java:12: error: illegal forward reference
$SwitchMap$evo$systems$base$rotation$mods$config$api$RotationModeType[mh.INTERPOLATION.ordinal()] = 2;
^
/storage/aboba/evovis-client/src/main/java/defpackage/ln.java:16: error: illegal forward reference
$SwitchMap$evo$systems$base$rotation$mods$config$api$RotationModeType[mh.AI.ordinal()] = 3;
^
/storage/aboba/evovis-client/src/main/java/defpackage/ox.java:8: error: illegal forward reference
$SwitchMap$evo$systems$base$training$DrillType[ou.FLICKING.ordinal()] = 1;
^
/storage/aboba/evovis-client/src/main/java/defpackage/ox.java:12: error: illegal forward reference
$SwitchMap$evo$systems$base$training$DrillType[ou.TRACKING.ordinal()] = 2;
^
/storage/aboba/evovis-client/src/main/java/defpackage/pf.java:8: error: illegal forward reference
$SwitchMap$evo$systems$utility$render$display$base$SurfaceRole[aso.CARD.ordinal()] = 1;
^
/storage/aboba/evovis-client/src/main/java/defpackage/pf.java:12: error: illegal forward reference
$SwitchMap$evo$systems$utility$render$display$base$SurfaceRole[aso.ROW.ordinal()] = 2;
^
/storage/aboba/evovis-client/src/main/java/defpackage/pq.java:8: error: illegal forward reference
$SwitchMap$evo$systems$social$InventoryShareService$ViewState[ank.READY.ordinal()] = 1;
^
/storage/aboba/evovis-client/src/main/java/defpackage/pq.java:12: error: illegal forward reference
$SwitchMap$evo$systems$social$InventoryShareService$ViewState[ank.WAITING.ordinal()] = 2;
^
/storage/aboba/evovis-client/src/main/java/defpackage/pq.java:16: error: illegal forward reference
$SwitchMap$evo$systems$social$InventoryShareService$ViewState[ank.LOADING.ordinal()] = 3;
^
/storage/aboba/evovis-client/src/main/java/defpackage/pq.java:20: error: illegal forward reference
$SwitchMap$evo$systems$social$InventoryShareService$ViewState[ank.DENIED.ordinal()] = 4;
^
/storage/aboba/evovis-client/src/main/java/defpackage/pq.java:24: error: illegal forward reference
$SwitchMap$evo$systems$social$InventoryShareService$ViewState[ank.FAILED.ordinal()] = 5;
^
/storage/aboba/evovis-client/src/main/java/defpackage/sx.java:8: error: illegal forward reference
$SwitchMap$evo$systems$cosmetic$graffiti$GraffitiSession$Status[ahc.TOO_FAR.ordinal()] = 1;
^
/storage/aboba/evovis-client/src/main/java/defpackage/sx.java:12: error: illegal forward reference
$SwitchMap$evo$systems$cosmetic$graffiti$GraffitiSession$Status[ahc.EMPTY.ordinal()] = 2;
^
/storage/aboba/evovis-client/src/main/java/defpackage/sx.java:16: error: illegal forward reference
$SwitchMap$evo$systems$cosmetic$graffiti$GraffitiSession$Status[ahc.COOLDOWN.ordinal()] = 3;
^
/storage/aboba/evovis-client/src/main/java/defpackage/sx.java:20: error: illegal forward reference
$SwitchMap$evo$systems$cosmetic$graffiti$GraffitiSession$Status[ahc.READY.ordinal()] = 4;
^
/storage/aboba/evovis-client/src/main/java/defpackage/sx.java:24: error: illegal forward reference
$SwitchMap$evo$systems$cosmetic$graffiti$GraffitiSession$Status[ahc.NO_TARGET.ordinal()] = 5;
^
/storage/aboba/evovis-client/src/main/java/defpackage/tn.java:8: error: illegal forward reference
$SwitchMap$evo$systems$client$modules$impl$render$Chams$TargetKind[tu.SELF.ordinal()] = 1;
^
/storage/aboba/evovis-client/src/main/java/defpackage/tn.java:12: error: illegal forward reference
$SwitchMap$evo$systems$client$modules$impl$render$Chams$TargetKind[tu.FRIEND.ordinal()] = 2;
^
/storage/aboba/evovis-client/src/main/java/defpackage/tn.java:16: error: illegal forward reference
$SwitchMap$evo$systems$client$modules$impl$render$Chams$TargetKind[tu.PLAYER.ordinal()] = 3;
^
/storage/aboba/evovis-client/src/main/java/defpackage/tn.java:20: error: illegal forward reference
$SwitchMap$evo$systems$client$modules$impl$render$Chams$TargetKind[tu.HOSTILE.ordinal()] = 4;
^
/storage/aboba/evovis-client/src/main/java/defpackage/tn.java:24: error: illegal forward reference
$SwitchMap$evo$systems$client$modules$impl$render$Chams$TargetKind[tu.PASSIVE.ordinal()] = 5;
^
/storage/aboba/evovis-client/src/main/java/defpackage/tn.java:28: error: illegal forward reference
$SwitchMap$evo$systems$client$modules$impl$render$Chams$TargetKind[tu.OTHER.ordinal()] = 6;
^
/storage/aboba/evovis-client/src/main/java/defpackage/ub.java:9: error: illegal forward reference
$SwitchMap$evo$systems$client$modules$impl$render$crosshair$CrosshairStyle[xh.DOT.ordinal()] = 1;
^
/storage/aboba/evovis-client/src/main/java/defpackage/ub.java:13: error: illegal forward reference
$SwitchMap$evo$systems$client$modules$impl$render$crosshair$CrosshairStyle[xh.CIRCLE.ordinal()] = 2;
^
/storage/aboba/evovis-client/src/main/java/defpackage/ub.java:17: error: illegal forward reference
$SwitchMap$evo$systems$client$modules$impl$render$crosshair$CrosshairStyle[xh.CIRCLE_DOT.ordinal()] = 3;
^
/storage/aboba/evovis-client/src/main/java/defpackage/uq.java:513: error: illegal forward reference
SPECIAL.put(Items.LAVA_BUCKET, (-1673520724 | 1673520739) + (-1673520724 & 1673520739));
^
/storage/aboba/evovis-client/src/main/java/defpackage/uq.java:514: error: illegal forward reference
SPECIAL.put(Items.GLOW_BERRIES, (-1379083793 ^ 1379083807) + ((-1379083793 & 1379083807) << 1));
^
/storage/aboba/evovis-client/src/main/java/defpackage/vl.java:2652: error: illegal forward reference
COS_LUT_8[var0] = (float)Math.cos(var1);
^
/storage/aboba/evovis-client/src/main/java/defpackage/vl.java:2653: error: illegal forward reference
SIN_LUT_8[var0] = (float)Math.sin(var1);
^
/storage/aboba/evovis-client/src/main/java/defpackage/vl.java:2658: error: illegal forward reference
COS_LUT_4[var5] = (float)Math.cos(var7);
^
/storage/aboba/evovis-client/src/main/java/defpackage/vl.java:2659: error: illegal forward reference
SIN_LUT_4[var5] = (float)Math.sin(var7);
^
/storage/aboba/evovis-client/src/main/java/defpackage/vl.java:2666: error: illegal forward reference
JOINT_COS_8[var2] = (float)Math.cos(var3);
^
/storage/aboba/evovis-client/src/main/java/defpackage/vl.java:2667: error: illegal forward reference
JOINT_SIN_8[var2] = (float)Math.sin(var3);
^
/storage/aboba/evovis-client/src/main/java/defpackage/vl.java:2675: error: illegal forward reference
JOINT_COS_4[var8] = (float)Math.cos(var9);
^
/storage/aboba/evovis-client/src/main/java/defpackage/vl.java:2676: error: illegal forward reference
JOINT_SIN_4[var8] = (float)Math.sin(var9);
^
/storage/aboba/evovis-client/src/main/java/defpackage/vp.java:1533: error: illegal forward reference
.withColorTargetState(new ColorTargetState(ADDITIVE))
^
/storage/aboba/evovis-client/src/main/java/defpackage/wg.java:1941: error: illegal forward reference
CRESCENT_COS[var2] = Mth.cos(var4);
^
/storage/aboba/evovis-client/src/main/java/defpackage/wg.java:1942: error: illegal forward reference
CRESCENT_SIN[var2] = Mth.sin(var4);
^
/storage/aboba/evovis-client/src/main/java/defpackage/wg.java:1943: error: illegal forward reference
CRESCENT_TAPER[var2] = Mth.sin((float) Math.PI * var3);
^
/storage/aboba/evovis-client/src/main/java/defpackage/wg.java:1944: error: illegal forward reference
CRESCENT_DEGREES[var2] = var4 / (float) (Math.PI / 180.0);
^
/storage/aboba/evovis-client/src/main/java/defpackage/wg.java:1949: error: illegal forward reference
RING_COS[var5] = Mth.cos(var1);
^
/storage/aboba/evovis-client/src/main/java/defpackage/wg.java:1950: error: illegal forward reference
RING_SIN[var5] = Mth.sin(var1);
^
/storage/aboba/evovis-client/src/main/java/defpackage/wg.java:1955: error: illegal forward reference
GLOW_COS[var6] = Mth.cos(var1);
^
/storage/aboba/evovis-client/src/main/java/defpackage/wg.java:1956: error: illegal forward reference
GLOW_SIN[var6] = Mth.sin(var1);
^
/storage/aboba/evovis-client/src/main/java/defpackage/wg.java:1964: error: illegal forward reference
BEAD_STACK_SIN[var7] = Mth.sin(var1);
^
/storage/aboba/evovis-client/src/main/java/defpackage/wg.java:1965: error: illegal forward reference
BEAD_STACK_COS[var7] = Mth.cos(var1);
^
/storage/aboba/evovis-client/src/main/java/defpackage/wg.java:1970: error: illegal forward reference
BEAD_SLICE_COS[var8] = Mth.cos(var1);
^
/storage/aboba/evovis-client/src/main/java/defpackage/wg.java:1971: error: illegal forward reference
BEAD_SLICE_SIN[var8] = Mth.sin(var1);
^
/storage/aboba/evovis-client/src/main/java/defpackage/wl.java:8: error: illegal forward reference
$SwitchMap$evo$systems$base$media$lyrics$whisper$WhisperTranscriber$State[la.DOWNLOADING.ordinal()] = 1;
^
/storage/aboba/evovis-client/src/main/java/defpackage/wl.java:12: error: illegal forward reference
$SwitchMap$evo$systems$base$media$lyrics$whisper$WhisperTranscriber$State[la.LOADING.ordinal()] = 2;
^
/storage/aboba/evovis-client/src/main/java/defpackage/wl.java:16: error: illegal forward reference
$SwitchMap$evo$systems$base$media$lyrics$whisper$WhisperTranscriber$State[la.FAILED.ordinal()] = 3;
^
/storage/aboba/evovis-client/src/main/java/defpackage/wl.java:20: error: illegal forward reference
$SwitchMap$evo$systems$base$media$lyrics$whisper$WhisperTranscriber$State[la.UNSUPPORTED_CPU.ordinal()] = 4;
^
/storage/aboba/evovis-client/src/main/java/defpackage/xe.java:9: error: illegal forward reference
$SwitchMap$evo$systems$client$modules$impl$render$crosshair$CooldownIndicator[ws.BAR.ordinal()] = 1;
^
/storage/aboba/evovis-client/src/main/java/defpackage/xe.java:13: error: illegal forward reference
$SwitchMap$evo$systems$client$modules$impl$render$crosshair$CooldownIndicator[ws.RING.ordinal()] = 2;
^
/storage/aboba/evovis-client/src/main/java/defpackage/xe.java:17: error: illegal forward reference
$SwitchMap$evo$systems$client$modules$impl$render$crosshair$CooldownIndicator[ws.SPREAD.ordinal()] = 3;
^
/storage/aboba/evovis-client/src/main/java/defpackage/xe.java:21: error: illegal forward reference
$SwitchMap$evo$systems$client$modules$impl$render$crosshair$CooldownIndicator[ws.OFF.ordinal()] = 4;
^
/storage/aboba/evovis-client/src/main/java/defpackage/yh.java:8: error: illegal forward reference
$SwitchMap$evo$systems$client$screens$menu$appearance$ConfirmDialog$Choice[yo.APPLY.ordinal()] = 1;
^
/storage/aboba/evovis-client/src/main/java/defpackage/yh.java:12: error: illegal forward reference
$SwitchMap$evo$systems$client$screens$menu$appearance$ConfirmDialog$Choice[yo.DISCARD.ordinal()] = 2;
^
/storage/aboba/evovis-client/src/main/java/defpackage/yh.java:16: error: illegal forward reference
$SwitchMap$evo$systems$client$screens$menu$appearance$ConfirmDialog$Choice[yo.KEEP.ordinal()] = 3;
^
/storage/aboba/evovis-client/src/main/java/defpackage/zi.java:8: error: illegal forward reference
$SwitchMap$evo$systems$base$theme$token$ThemeToken$Kind[ol.SLIDER.ordinal()] = 1;
^
/storage/aboba/evovis-client/src/main/java/defpackage/zi.java:12: error: illegal forward reference
$SwitchMap$evo$systems$base$theme$token$ThemeToken$Kind[ol.COLOR.ordinal()] = 2;
^
/storage/aboba/evovis-client/src/main/java/defpackage/zi.java:16: error: illegal forward reference
$SwitchMap$evo$systems$base$theme$token$ThemeToken$Kind[ol.FLAG.ordinal()] = 3;
^
/storage/aboba/evovis-client/src/main/java/defpackage/zi.java:20: error: illegal forward reference
$SwitchMap$evo$systems$base$theme$token$ThemeToken$Kind[ol.CHOICE.ordinal()] = 4;
^
/storage/aboba/evovis-client/src/main/java/defpackage/zi.java:24: error: illegal forward reference
$SwitchMap$evo$systems$base$theme$token$ThemeToken$Kind[ol.ACTION.ordinal()] = 5;
^
/storage/aboba/evovis-client/src/main/java/defpackage/zp.java:8: error: illegal forward reference
$SwitchMap$evo$systems$base$theme$token$ThemeToken$Kind[ol.SLIDER.ordinal()] = 1;
^
/storage/aboba/evovis-client/src/main/java/defpackage/zp.java:12: error: illegal forward reference
$SwitchMap$evo$systems$base$theme$token$ThemeToken$Kind[ol.COLOR.ordinal()] = 2;
^
/storage/aboba/evovis-client/src/main/java/defpackage/zp.java:16: error: illegal forward reference
$SwitchMap$evo$systems$base$theme$token$ThemeToken$Kind[ol.FLAG.ordinal()] = 3;
^
/storage/aboba/evovis-client/src/main/java/defpackage/zp.java:20: error: illegal forward reference
$SwitchMap$evo$systems$base$theme$token$ThemeToken$Kind[ol.CHOICE.ordinal()] = 4;
^
/storage/aboba/evovis-client/src/main/java/defpackage/zp.java:24: error: illegal forward reference
$SwitchMap$evo$systems$base$theme$token$ThemeToken$Kind[ol.ACTION.ordinal()] = 5;
^
/storage/aboba/evovis-client/src/main/java/defpackage/zs.java:8: error: illegal forward reference
$SwitchMap$evo$systems$base$theme$style$StyleVariant$Preview[nh.CORNER.ordinal()] = 1;
^
/storage/aboba/evovis-client/src/main/java/defpackage/zs.java:12: error: illegal forward reference
$SwitchMap$evo$systems$base$theme$style$StyleVariant$Preview[nh.BORDER.ordinal()] = 2;
^
/storage/aboba/evovis-client/src/main/java/defpackage/zs.java:16: error: illegal forward reference
$SwitchMap$evo$systems$base$theme$style$StyleVariant$Preview[nh.DIVIDER.ordinal()] = 3;
^
/storage/aboba/evovis-client/src/main/java/defpackage/zs.java:20: error: illegal forward reference
$SwitchMap$evo$systems$base$theme$style$StyleVariant$Preview[nh.DEPTH.ordinal()] = 4;
^
/storage/aboba/evovis-client/src/main/java/defpackage/zs.java:24: error: illegal forward reference
$SwitchMap$evo$systems$base$theme$style$StyleVariant$Preview[nh.GLOW.ordinal()] = 5;
^
/storage/aboba/evovis-client/src/main/java/defpackage/zs.java:28: error: illegal forward reference
$SwitchMap$evo$systems$base$theme$style$StyleVariant$Preview[nh.SWEEP.ordinal()] = 6;
^
/storage/aboba/evovis-client/src/main/java/defpackage/zs.java:32: error: illegal forward reference
$SwitchMap$evo$systems$base$theme$style$StyleVariant$Preview[nh.GLASS.ordinal()] = 7;
^
/storage/aboba/evovis-client/src/main/java/defpackage/zs.java:36: error: illegal forward reference
$SwitchMap$evo$systems$base$theme$style$StyleVariant$Preview[nh.MOTION.ordinal()] = 8;
^
/storage/aboba/evovis-client/src/main/java/defpackage/zs.java:40: error: illegal forward reference
$SwitchMap$evo$systems$base$theme$style$StyleVariant$Preview[nh.TEXT_SCALE.ordinal()] = 9;
^
/storage/aboba/evovis-client/src/main/java/defpackage/zs.java:44: error: illegal forward reference
$SwitchMap$evo$systems$base$theme$style$StyleVariant$Preview[nh.FONT.ordinal()] = 10;
^
/storage/aboba/evovis-client/src/main/java/defpackage/zs.java:48: error: illegal forward reference
$SwitchMap$evo$systems$base$theme$style$StyleVariant$Preview[nh.DENSITY.ordinal()] = 11;
^
/storage/aboba/evovis-client/src/main/java/defpackage/zs.java:52: error: illegal forward reference
$SwitchMap$evo$systems$base$theme$style$StyleVariant$Preview[nh.SPACING.ordinal()] = 12;
^
/storage/aboba/evovis-client/src/main/java/defpackage/zs.java:56: error: illegal forward reference
$SwitchMap$evo$systems$base$theme$style$StyleVariant$Preview[nh.POLARITY.ordinal()] = 13;
^
/storage/aboba/evovis-client/src/main/java/defpackage/zs.java:60: error: illegal forward reference
$SwitchMap$evo$systems$base$theme$style$StyleVariant$Preview[nh.HARMONY.ordinal()] = 14;
^
/storage/aboba/evovis-client/src/main/java/defpackage/zs.java:64: error: illegal forward reference
$SwitchMap$evo$systems$base$theme$style$StyleVariant$Preview[nh.BACKDROP.ordinal()] = 15;
^
/storage/aboba/evovis-client/src/main/java/defpackage/zs.java:68: error: illegal forward reference
$SwitchMap$evo$systems$base$theme$style$StyleVariant$Preview[nh.INTENSITY.ordinal()] = 16;
^
Note: Some input files use or override a deprecated API.
Note: Recompile with -Xlint:deprecation for details.
Note: Some input files use unchecked or unsafe operations.
Note: Recompile with -Xlint:unchecked for details.
276 errors
FAILURE: Build failed with an exception.
* What went wrong:
Execution failed for task ':compileJava' (registered by plugin class 'org.gradle.api.plugins.JavaBasePlugin').
> Compilation failed; see the compiler output below.
/storage/aboba/evovis-client/src/main/java/defpackage/yt.java:98: error: illegal forward reference
LABELS.put(nr.MONOCHROME, "Mono");
^
276 errors
* Try:
> Check your code and dependencies to fix the compilation error(s)
> Run with --scan to get full insights from a Build Scan (powered by Develocity).
BUILD FAILED in 9s

4
build-logs/vfbuild93.log Normal file
View file

@ -0,0 +1,4 @@
Note: /storage/aboba/evovis-client/src/main/java/defpackage/bz.java uses or overrides a deprecated API.
Note: Recompile with -Xlint:deprecation for details.
Note: Some input files use unchecked or unsafe operations.
Note: Recompile with -Xlint:unchecked for details.

4
build-logs/vfbuild94.log Normal file
View file

@ -0,0 +1,4 @@
Note: Some input files use or override a deprecated API.
Note: Recompile with -Xlint:deprecation for details.
Note: Some input files use unchecked or unsafe operations.
Note: Recompile with -Xlint:unchecked for details.

4
build-logs/vfbuild95.log Normal file
View file

@ -0,0 +1,4 @@
Note: Some input files use or override a deprecated API.
Note: Recompile with -Xlint:deprecation for details.
Note: Some input files use unchecked or unsafe operations.
Note: Recompile with -Xlint:unchecked for details.

4
build-logs/vfbuild96.log Normal file
View file

@ -0,0 +1,4 @@
Note: Some input files use or override a deprecated API.
Note: Recompile with -Xlint:deprecation for details.
Note: Some input files use unchecked or unsafe operations.
Note: Recompile with -Xlint:unchecked for details.

View file

@ -1823,7 +1823,7 @@ public class aah {
var12, var12,
Math.abs( Math.abs(
-9.0F -9.0F
+ var9[var10 * 5] + var9[var10 * (4) + 1]
* 16.0F * 16.0F
* 0.5F * 0.5F
) )
@ -1943,9 +1943,9 @@ public class aah {
aik var14 = var10.corners[var13]; aik var14 = var10.corners[var13];
var2.transformPosition(var14.position.x, var14.position.y, var14.position.z, var4); var2.transformPosition(var14.position.x, var14.position.y, var14.position.z, var4);
var11[var13 * (4)] = var4.x(); var11[var13 * (4)] = var4.x();
var11[var13 * 5] = -var4.y(); var11[var13 * (4) + 1] = -var4.y();
var11[var13 * 6] = var14.u; var11[var13 * (4) + 2] = var14.u;
var11[var13 * 7] = var14.v; var11[var13 * (4) + 3] = var14.v;
var12 += var4.z(); var12 += var4.z();
} }

View file

@ -59,7 +59,6 @@ public final class aco {
private static final acn[] METRICS_LADDER; private static final acn[] METRICS_LADDER;
private static final Comparator<acr> ORDER = Comparator.comparingInt(acr::getPriority).thenComparingInt(acr::getOrder); private static final Comparator<acr> ORDER = Comparator.comparingInt(acr::getPriority).thenComparingInt(acr::getOrder);
private static final Map<String, acs> VANILLA_STYLES = vanillaStyles(); private static final Map<String, acs> VANILLA_STYLES = vanillaStyles();
public static final aco INSTANCE = new aco();
public static final float BRAND_LOGO_RATIO = 0.62F; public static final float BRAND_LOGO_RATIO = 0.62F;
private static final float BRAND_CENTER = 0.5F; private static final float BRAND_CENTER = 0.5F;
private final List<acr> slots = new ArrayList<>(); private final List<acr> slots = new ArrayList<>();
@ -1134,4 +1133,6 @@ public final class aco {
var10000[2] = new acn(6.0F, 18.0F, 14.0F, 2.0F, 13.0F, 3.0F, 5.0F, 16.0F, 0.0F); var10000[2] = new acn(6.0F, 18.0F, 14.0F, 2.0F, 13.0F, 3.0F, 5.0F, 16.0F, 0.0F);
METRICS_LADDER = var10000; METRICS_LADDER = var10000;
} }
public static final aco INSTANCE = new aco();
} }

View file

@ -170,6 +170,10 @@ public final class adx {
} }
public static boolean isOwned(String var0, String var1) { public static boolean isOwned(String var0, String var1) {
if (!confirmed) {
return true;
}
int var2 = 648232911; int var2 = 648232911;
while (true) { while (true) {

View file

@ -39,7 +39,7 @@ public final class aem {
} }
break; break;
case -1519381057: case -1519381057:
var1 = new int[var0.length * 0]; var1 = new int[var0.length * 2 - 2];
System.arraycopy( System.arraycopy(
var0, var0,
0, 0,

View file

@ -961,7 +961,7 @@ public final class ahn {
for (int var15 = 0; var15 < 4; var15++) { for (int var15 = 0; var15 < 4; var15++) {
int var16 = var15 * (4); int var16 = var15 * (4);
var12[var15 * (2)] = (var14[var16] - var19) * var18 + 160.0F; var12[var15 * (2)] = (var14[var16] - var19) * var18 + 160.0F;
var12[var15 * 3] = ( var12[var15 * (2) + 1] = (
var14[var16 + 1] - var20 var14[var16 + 1] - var20
) )
* var18 * var18
@ -1067,11 +1067,11 @@ public final class ahn {
case 536920082: case 536920082:
default: default:
var8 = var0[var1 * (2)]; var8 = var0[var1 * (2)];
var9 = var0[var1 * 3]; var9 = var0[var1 * (2) + 1];
var10 = var0[var2 * (2)]; var10 = var0[var2 * (2)];
var11 = var0[var2 * 3]; var11 = var0[var2 * (2) + 1];
var12 = var0[var3 * (2)]; var12 = var0[var3 * (2)];
var13 = var0[var3 * 3]; var13 = var0[var3 * (2) + 1];
var14 = (var11 - var13) * (var8 - var12) + (var12 - var10) * (var9 - var13); var14 = (var11 - var13) * (var8 - var12) + (var12 - var10) * (var9 - var13);
if (Math.abs(var14) < 1.0E-9F) { if (Math.abs(var14) < 1.0E-9F) {
var27 = 1261011979; var27 = 1261011979;

View file

@ -64,11 +64,11 @@ public final class ahw {
} }
public float pivotY(int var1) { public float pivotY(int var1) {
return this.bonePivots[var1 * 4]; return this.bonePivots[var1 * (3) + 1];
} }
public float pivotZ(int var1) { public float pivotZ(int var1) {
return this.bonePivots[var1 * 5]; return this.bonePivots[var1 * (3) + 2];
} }
public float restRotationX(int var1) { public float restRotationX(int var1) {
@ -76,11 +76,11 @@ public final class ahw {
} }
public float restRotationY(int var1) { public float restRotationY(int var1) {
return this.boneRestRotation[var1 * 4]; return this.boneRestRotation[var1 * (3) + 1];
} }
public float restRotationZ(int var1) { public float restRotationZ(int var1) {
return this.boneRestRotation[var1 * 5]; return this.boneRestRotation[var1 * (3) + 2];
} }
public float[] meshOf(int var1) { public float[] meshOf(int var1) {
@ -174,11 +174,11 @@ public final class ahw {
var5[var14] = var11.parent == null var5[var14] = var11.parent == null
? -1: ((Integer)var9.getOrDefault(var11.parent.name, (1226890724 | -1226890725) + (1226890724 & -1226890725))); ? -1: ((Integer)var9.getOrDefault(var11.parent.name, (1226890724 | -1226890725) + (1226890724 & -1226890725)));
var6[var14 * (3)] = var11.pivotX; var6[var14 * (3)] = var11.pivotX;
var6[var14 * 4] = var11.pivotY; var6[var14 * (3) + 1] = var11.pivotY;
var6[var14 * 5] = var11.pivotZ; var6[var14 * (3) + 2] = var11.pivotZ;
var7[var14 * (3)] = var11.getRotX(); var7[var14 * (3)] = var11.getRotX();
var7[var14 * 4] = var11.getRotY(); var7[var14 * (3) + 1] = var11.getRotY();
var7[var14 * 5] = var11.getRotZ(); var7[var14 * (3) + 2] = var11.getRotZ();
var8[var14] = bakeMesh(var11); var8[var14] = bakeMesh(var11);
} }

View file

@ -33,7 +33,6 @@ public final class aio implements aqg {
private static final float NORMAL_Y = 1.0F; private static final float NORMAL_Y = 1.0F;
private static final float NORMAL_Z = 0.0F; private static final float NORMAL_Z = 0.0F;
private static final float[] CORNER_V; private static final float[] CORNER_V;
private static final aio INSTANCE = new aio();
private final float[] corners = new float[192]; private final float[] corners = new float[192];
private final float[] minU = new float[16]; private final float[] minU = new float[16];
private final float[] maxU = new float[16]; private final float[] maxU = new float[16];
@ -334,4 +333,6 @@ public final class aio implements aqg {
var10000[3] = 0.0F; var10000[3] = 0.0F;
CORNER_V = var10000; CORNER_V = var10000;
} }
private static final aio INSTANCE = new aio();
} }

View file

@ -15,7 +15,6 @@ import org.joml.Matrix4f;
import org.joml.Vector3f; import org.joml.Vector3f;
public final class aiv { public final class aiv {
private static final aiv INSTANCE = new aiv();
private static final Identifier SOLID = Identifier.fromNamespaceAndPath( private static final Identifier SOLID = Identifier.fromNamespaceAndPath(
"evolution", "textures/white.png" "evolution", "textures/white.png"
); );
@ -581,4 +580,6 @@ public final class aiv {
var10000[2] = 0.78F; var10000[2] = 0.78F;
OPEN_FACE = var10000; OPEN_FACE = var10000;
} }
private static final aiv INSTANCE = new aiv();
} }

View file

@ -3,7 +3,6 @@ package defpackage;
import java.util.concurrent.atomic.AtomicLong; import java.util.concurrent.atomic.AtomicLong;
public final class aje { public final class aje {
private static final aje INSTANCE = new aje();
private static final String STATUS_BUSY = "auto tune is busy"; private static final String STATUS_BUSY = "auto tune is busy";
private static final String STATUS_NO_WORLD = "auto tune needs a loaded world"; private static final String STATUS_NO_WORLD = "auto tune needs a loaded world";
private static final String STATUS_DISABLED = "enable Replay before auto tune"; private static final String STATUS_DISABLED = "enable Replay before auto tune";
@ -616,4 +615,6 @@ public final class aje {
var10000[5] = 30; var10000[5] = 30;
FRAMERATE_STEPS = var10000; FRAMERATE_STEPS = var10000;
} }
private static final aje INSTANCE = new aje();
} }

View file

@ -726,7 +726,11 @@ public final class aod {
var6 = var8; var6 = var8;
this.texture = null; this.texture = null;
this.display = null; this.display = null;
daemon(() -> this.reap(var4, var5, var3, var6 != 0), "EvoWatchReaper-" + this.serial); final SourceDataLine var3f = var3;
final Thread var4f = var4;
final Thread var5f = var5;
final int var6f = var6;
daemon(() -> this.reap(var4f, var5f, var3f, var6f != 0), "EvoWatchReaper-" + this.serial);
return; return;
} }
} }
@ -749,6 +753,8 @@ public final class aod {
break; break;
case -1522287563: case -1522287563:
var6 = Minecraft.getInstance(); var6 = Minecraft.getInstance();
final Minecraft var6f = var6;
final int var5f = var5;
var6.execute(() -> { var6.execute(() -> {
Iterator var4x = null; Iterator var4x = null;
Object var5x = null; Object var5x = null;
@ -760,7 +766,7 @@ public final class aod {
this.slots.clear(); this.slots.clear();
return; return;
case -641230427: case -641230427:
var6.getTextureManager().release(this.textureId); var6f.getTextureManager().release(this.textureId);
var6x = 1840619191; var6x = 1840619191;
break; break;
case -633768204: case -633768204:
@ -792,7 +798,7 @@ public final class aod {
} }
break; break;
case 1840619191: case 1840619191:
if (var5 == 0) { if (var5f == 0) {
var6x = 578258790; var6x = 578258790;
} else { } else {
var6x = -339008966; var6x = -339008966;

View file

@ -508,6 +508,7 @@ public final class aoh {
break; break;
case 384071026: case 384071026:
var1 = System.currentTimeMillis(); var1 = System.currentTimeMillis();
final long var1f = var1;
remotes.values().removeIf(var2 -> { remotes.values().removeIf(var2 -> {
int var4 = 0; int var4 = 0;
int var3x = -127318578; int var3x = -127318578;
@ -515,7 +516,7 @@ public final class aoh {
while (true) { while (true) {
switch (var3x) { switch (var3x) {
case -2062251368: case -2062251368:
if (var1 - var2.hiddenAt > (7695969247871140036L ^ -7695969247871139816L) + ((7695969247871140036L & -7695969247871139816L) << 1)) { if (var1f - var2.hiddenAt > (7695969247871140036L ^ -7695969247871139816L) + ((7695969247871140036L & -7695969247871139816L) << 1)) {
var3x = 379224821; var3x = 379224821;
} else { } else {
var3x = 647044035; var3x = 647044035;
@ -544,7 +545,7 @@ public final class aoh {
case 1442593975: case 1442593975:
return (boolean)((var4) != 0); return (boolean)((var4) != 0);
case 1802946231: case 1802946231:
if (var1 - var2.receivedAt > (-5039970975211645647L | 5039970975211651647L) + (-5039970975211645647L & 5039970975211651647L)) { if (var1f - var2.receivedAt > (-5039970975211645647L | 5039970975211651647L) + (-5039970975211645647L & 5039970975211651647L)) {
var3x = -217533163; var3x = -217533163;
} else { } else {
var3x = 1940673852; var3x = 1940673852;

View file

@ -339,8 +339,9 @@ public final class aox {
} }
break; break;
case -1418220367: case -1418220367:
SPEAKERS_BY_ID.values().removeIf(var2x -> isEvictable(var2x, var0)); final long var0f = var0;
SPEAKERS.removeIf(var2x -> isEvictable(var2x, var0)); SPEAKERS_BY_ID.values().removeIf(var2x -> isEvictable(var2x, var0f));
SPEAKERS.removeIf(var2x -> isEvictable(var2x, var0f));
var6 = 1153886167; var6 = 1153886167;
break; break;
case -1126595322: case -1126595322:

View file

@ -50,7 +50,7 @@ public final class aoz {
} }
} }
public static byte[] encryptData(byte[] var0, String var1) { public static byte[] encryptData(byte[] var0, String var1) throws Exception {
try { try {
SecureRandom var2 = new SecureRandom(); SecureRandom var2 = new SecureRandom();
byte[] var3 = new byte[16]; byte[] var3 = new byte[16];

View file

@ -56,6 +56,11 @@ public final class aph implements aqg {
boolean[] var15 = new boolean[1]; boolean[] var15 = new boolean[1];
var15[0] = (boolean)(((0)) != 0); var15[0] = (boolean)(((0)) != 0);
var7 = var15; var7 = var15;
final MutableComponent var3f = var3;
final StringBuilder var4f = var4;
final Style[] var5f = var5;
final int[] var6f = var6;
final boolean[] var7f = var7;
var2.accept( var2.accept(
(var5x, var6x, var7x) -> { (var5x, var6x, var7x) -> {
int var8x = 1084049607; int var8x = 1084049607;
@ -63,31 +68,31 @@ public final class aph implements aqg {
while (true) { while (true) {
switch (var8x) { switch (var8x) {
case -1703394922: case -1703394922:
var3.append(Component.literal(var4.toString()).setStyle(var5[0])); var3f.append(Component.literal(var4f.toString()).setStyle(var5f[0]));
var4.setLength((-674859503 ^ 674859503) + ((-674859503 & 674859503) << 1)); var4f.setLength((-674859503 ^ 674859503) + ((-674859503 & 674859503) << 1));
var8x = 783433085; var8x = 783433085;
break; break;
case -771165409: case -771165409:
if (!var6x.equals(var5[0])) { if (!var6x.equals(var5f[0])) {
var8x = 1945809697; var8x = 1945809697;
} else { } else {
var8x = 1177578328; var8x = 1177578328;
} }
break; break;
case -381428002: case -381428002:
var6[0] = var6[0] var6f[0] = var6f[0]
+ 1; + 1;
var8x = 385287135; var8x = 385287135;
break; break;
case 385287135: case 385287135:
return (boolean)(((1)) != 0); return (boolean)(((1)) != 0);
case 783433085: case 783433085:
var5[0] = var6x; var5f[0] = var6x;
var8x = 1177578328; var8x = 1177578328;
break; break;
case 1084049607: case 1084049607:
default: default:
if (var6[0] if (var6f[0]
> (-349772217 ^ 349772219) + ((-349772217 & 349772219) << 1)) { > (-349772217 ^ 349772219) + ((-349772217 & 349772219) << 1)) {
var8x = 1235672366; var8x = 1235672366;
} else { } else {
@ -95,7 +100,7 @@ public final class aph implements aqg {
} }
break; break;
case 1177578328: case 1177578328:
var4.appendCodePoint(var7x); var4f.appendCodePoint(var7x);
if (Character.isWhitespace(var7x)) { if (Character.isWhitespace(var7x)) {
var8x = -381428002; var8x = -381428002;
} else { } else {
@ -103,10 +108,10 @@ public final class aph implements aqg {
} }
break; break;
case 1235672366: case 1235672366:
var7[0] = (boolean)(((1)) != 0); var7f[0] = (boolean)(((1)) != 0);
return (boolean)(((0)) != 0); return (boolean)(((0)) != 0);
case 1945809697: case 1945809697:
if (!var4.isEmpty()) { if (!var4f.isEmpty()) {
var8x = -1703394922; var8x = -1703394922;
} else { } else {
var8x = 783433085; var8x = 783433085;
@ -174,6 +179,11 @@ public final class aph implements aqg {
int[] var16 = new int[1]; int[] var16 = new int[1];
var16[0] = 0; var16[0] = 0;
var8 = var16; var8 = var16;
final int var4f = var4;
final MutableComponent var5f = var5;
final StringBuilder var6f = var6;
final Style[] var7f = var7;
final int[] var8f = var8;
var2.accept( var2.accept(
(var6x, var7x, var8x) -> { (var6x, var7x, var8x) -> {
int var9x = 0; int var9x = 0;
@ -183,12 +193,12 @@ public final class aph implements aqg {
while (true) { while (true) {
switch (var10x) { switch (var10x) {
case -586613524: case -586613524:
var6.appendCodePoint(var8x); var6f.appendCodePoint(var8x);
var8[0] = var8[0] var8f[0] = var8f[0]
+ 1; + 1;
return (boolean)(((1)) != 0); return (boolean)(((1)) != 0);
case 106504302: case 106504302:
if (!var7[0].equals(var7x)) { if (!var7f[0].equals(var7x)) {
var10x = 1910251675; var10x = 1910251675;
} else { } else {
var10x = 1948794320; var10x = 1948794320;
@ -196,7 +206,7 @@ public final class aph implements aqg {
break; break;
case 274562501: case 274562501:
default: default:
if (var8[0] == var4) { if (var8f[0] == var4f) {
var10x = 878307549; var10x = 878307549;
} else { } else {
var10x = 1625901289; var10x = 1625901289;
@ -211,8 +221,8 @@ public final class aph implements aqg {
var10x = 1969569466; var10x = 1969569466;
break; break;
case 1910251675: case 1910251675:
flushRun(var5, var6, var7[0]); flushRun(var5f, var6f, var7f[0]);
var7[0] = var7x; var7f[0] = var7x;
var10x = 1948794320; var10x = 1948794320;
break; break;
case 1948794320: case 1948794320:
@ -224,7 +234,7 @@ public final class aph implements aqg {
break; break;
case 1969569466: case 1969569466:
var9x = var11x; var9x = var11x;
if (var7[0] != null) { if (var7f[0] != null) {
var10x = 106504302; var10x = 106504302;
} else { } else {
var10x = 1910251675; var10x = 1910251675;
@ -242,9 +252,10 @@ public final class aph implements aqg {
int[] var10000 = new int[1]; int[] var10000 = new int[1];
var10000[0] = 0; var10000[0] = 0;
var3 = var10000; var3 = var10000;
final int[] var3f = var3;
var2.accept( var2.accept(
(var1x, var2x, var3x) -> { (var1x, var2x, var3x) -> {
var3[0] = var3[0] var3f[0] = var3f[0]
+ 1; + 1;
return (boolean)(((1)) != 0); return (boolean)(((1)) != 0);
} }
@ -345,6 +356,11 @@ public final class aph implements aqg {
boolean[] var15 = new boolean[1]; boolean[] var15 = new boolean[1];
var15[0] = (boolean)(((0)) != 0); var15[0] = (boolean)(((0)) != 0);
var8 = var15; var8 = var15;
final MutableComponent var4f = var4;
final StringBuilder var5f = var5;
final Style[] var6f = var6;
final StringBuilder var7f = var7;
final boolean[] var8f = var8;
var3.accept( var3.accept(
(var6x, var7x, var8x) -> { (var6x, var7x, var8x) -> {
String var9x = null; String var9x = null;
@ -353,18 +369,18 @@ public final class aph implements aqg {
while (true) { while (true) {
switch (var10x) { switch (var10x) {
case -2095139869: case -2095139869:
var5.append(var9x); var5f.append(var9x);
return (boolean)(((1)) != 0); return (boolean)(((1)) != 0);
case -1551500034: case -1551500034:
if (var5.length() > 0) { if (var5f.length() > 0) {
var10x = 1840159626; var10x = 1840159626;
} else { } else {
var10x = 811586702; var10x = 811586702;
} }
break; break;
case -214225470: case -214225470:
var7.append(var9x); var7f.append(var9x);
if (!var7x.equals(var6[0])) { if (!var7x.equals(var6f[0])) {
var10x = -1551500034; var10x = -1551500034;
} else { } else {
var10x = -2095139869; var10x = -2095139869;
@ -373,23 +389,23 @@ public final class aph implements aqg {
case 301151911: case 301151911:
default: default:
var9x = new String(Character.toChars(var8x)); var9x = new String(Character.toChars(var8x));
if (var7.toString().contains(var1)) { if (var7f.toString().contains(var1)) {
var10x = 1874734084; var10x = 1874734084;
} else { } else {
var10x = -214225470; var10x = -214225470;
} }
break; break;
case 811586702: case 811586702:
var6[0] = var7x; var6f[0] = var7x;
var10x = -2095139869; var10x = -2095139869;
break; break;
case 1840159626: case 1840159626:
var4.append(Component.literal(var5.toString()).setStyle(var6[0])); var4f.append(Component.literal(var5f.toString()).setStyle(var6f[0]));
var5.setLength((2147089639 ^ -2147089639) + ((2147089639 & -2147089639) << 1)); var5f.setLength((2147089639 ^ -2147089639) + ((2147089639 & -2147089639) << 1));
var10x = 811586702; var10x = 811586702;
break; break;
case 1874734084: case 1874734084:
var8[0] = (boolean)(((1)) != 0); var8f[0] = (boolean)(((1)) != 0);
return (boolean)(((0)) != 0); return (boolean)(((0)) != 0);
} }
} }

View file

@ -333,6 +333,7 @@ public final class apq implements aqf {
switch (var9) { switch (var9) {
case -2070803161: case -2070803161:
var4 = var10; var4 = var10;
final MobEffectCategory var4f = var4;
var5 = StreamSupport.<MobEffectInstance>stream( var5 = StreamSupport.<MobEffectInstance>stream(
var3.getAllEffects().spliterator(), (boolean)((((1975658698 ^ -1975658698) + ((1975658698 & -1975658698) << 1)) var3.getAllEffects().spliterator(), (boolean)((((1975658698 ^ -1975658698) + ((1975658698 & -1975658698) << 1))
) != 0)) ) != 0))
@ -341,7 +342,7 @@ public final class apq implements aqf {
var7 = StreamSupport.<MobEffectInstance>stream( var7 = StreamSupport.<MobEffectInstance>stream(
var3.getAllEffects().spliterator(), (boolean)((((-1601101769 ^ 1601101769) + ((-1601101769 & 1601101769) << 1)) var3.getAllEffects().spliterator(), (boolean)((((-1601101769 ^ 1601101769) + ((-1601101769 & 1601101769) << 1))
) != 0)) ) != 0))
.filter(var1x -> ((MobEffect)var1x.getEffect().value()).getCategory().equals(var4)) .filter(var1x -> ((MobEffect)var1x.getEffect().value()).getCategory().equals(var4f))
.count(); .count();
if (var5 >= var7) { if (var5 >= var7) {
var9 = -464259917; var9 = -464259917;
@ -533,7 +534,8 @@ public final class apq implements aqf {
} }
break; break;
case 1613240963: case 1613240963:
app.addTask(() -> swapAndUse(var3, var1)); final Slot var3f = var3;
app.addTask(() -> swapAndUse(var3f, var1));
return; return;
case 1831076889: case 1831076889:
bz.getInstance() bz.getInstance()
@ -663,7 +665,8 @@ public final class apq implements aqf {
} }
break; break;
case -730314354: case -730314354:
app.addTask(() -> clickSlot(var1, var0 - var4, ContainerInput.SWAP, (boolean)((((-1126116924 ^ 1126116924) + ((-1126116924 & 1126116924) << 1))) != 0))); final int var4f = var4;
app.addTask(() -> clickSlot(var1, var0 - var4f, ContainerInput.SWAP, (boolean)((((-1126116924 ^ 1126116924) + ((-1126116924 & 1126116924) << 1))) != 0)));
var5 = 84004240; var5 = 84004240;
break; break;
case -469799216: case -469799216:

View file

@ -426,9 +426,11 @@ public class apt implements aqg {
} }
break; break;
case -446377969: case -446377969:
final Vec3 var4f = var4;
final Vec3 var5f = var5;
return var1.stream() return var1.stream()
.filter(var4x -> this.isValidPoint(var4, var4x, var2, var3)) .filter(var4x -> this.isValidPoint(var4f, var4x, var2, var3))
.min(Comparator.comparingDouble(var1x -> var1x.distanceToSqr(var5))) .min(Comparator.comparingDouble(var1x -> var1x.distanceToSqr(var5f)))
.orElse(null); .orElse(null);
case 1088111936: case 1088111936:
return var5; return var5;
@ -557,7 +559,8 @@ public class apt implements aqg {
switch (var3) { switch (var3) {
case -802008674: case -802008674:
var2 = mc.player.getEyePosition(); var2 = mc.player.getEyePosition();
return var1.stream().min(Comparator.comparingDouble(var1x -> var1x.distanceToSqr(var2))).orElse(null); final Vec3 var2f = var2;
return var1.stream().min(Comparator.comparingDouble(var1x -> var1x.distanceToSqr(var2f))).orElse(null);
case -513277881: case -513277881:
default: default:
if (var1 != null) { if (var1 != null) {

View file

@ -598,7 +598,8 @@ public final class aqr {
} }
break; break;
case -532403294: case -532403294:
return SOURCES.computeIfAbsent(var0, var1x -> var2.factory().get()); final aqp var2f = var2;
return SOURCES.computeIfAbsent(var0, var1x -> var2f.factory().get());
case 415929668: case 415929668:
var2 = CATALOG.get(var1); var2 = CATALOG.get(var1);
if (var2.id().equals(var0)) { if (var2.id().equals(var0)) {

View file

@ -14,7 +14,7 @@ final class ara {
Matrix4f next() { Matrix4f next() {
Matrix4f var1 = this.matrices[this.cursor]; Matrix4f var1 = this.matrices[this.cursor];
this.cursor = this.cursor + 1; this.cursor = (this.cursor + 1) & 7;
return var1; return var1;
} }
} }

View file

@ -124,7 +124,9 @@ public final class arh implements aqg {
case 784027221: case 784027221:
var3 = arj.positionColor(); var3 = arj.positionColor();
var4 = arj.begin(var3); var4 = arj.begin(var3);
QUAD.forEach(var2x -> quad(var2, var4, var2x.x, var2x.y, var2x.width, var2x.height, var2x.color)); final Matrix4f var2f = var2;
final BufferBuilder var4f = var4;
QUAD.forEach(var2x -> quad(var2f, var4f, var2x.x, var2x.y, var2x.width, var2x.height, var2x.color));
arj.draw(var3, var4); arj.draw(var3, var4);
QUAD.clear(); QUAD.clear();
var5 = -1401689963; var5 = -1401689963;

View file

@ -82,15 +82,15 @@ public final class asl {
} }
public float y(int var1) { public float y(int var1) {
return this.values[var1 * 5]; return this.values[var1 * (4) + 1];
} }
public float width(int var1) { public float width(int var1) {
return this.values[var1 * 6]; return this.values[var1 * (4) + 2];
} }
public float height(int var1) { public float height(int var1) {
return this.values[var1 * 7]; return this.values[var1 * (4) + 3];
} }
public boolean contains(int var1, double var2, double var4) { public boolean contains(int var1, double var2, double var4) {

View file

@ -185,9 +185,9 @@ public class asu {
} }
public static asu fromInt(int var0) { public static asu fromInt(int var0) {
int var1 = var0 >> 24; int var1 = var0 >> 24 & 255;
int var2 = var0 >> 16; int var2 = var0 >> 16 & 255;
int var3 = var0 >> 8; int var3 = var0 >> 8 & 255;
int var4 = var0 & 255; int var4 = var0 & 255;
return new asu(var2, var3, var4, var1); return new asu(var2, var3, var4, var1);
} }
@ -228,13 +228,13 @@ public class asu {
public static int mixRGB(int var0, int var1, float var2, float var3) { public static int mixRGB(int var0, int var1, float var2, float var3) {
var2 = Math.min(1.0F, Math.max(0.0F, var2)); var2 = Math.min(1.0F, Math.max(0.0F, var2));
int var4 = var0 >> 24; int var4 = var0 >> 24 & 255;
int var5 = var0 >> 16; int var5 = var0 >> 16 & 255;
int var6 = var0 >> 8; int var6 = var0 >> 8 & 255;
int var7 = var0 & 255; int var7 = var0 & 255;
int var8 = var1 >> 24; int var8 = var1 >> 24 & 255;
int var9 = var1 >> 16; int var9 = var1 >> 16 & 255;
int var10 = var1 >> 8; int var10 = var1 >> 8 & 255;
int var11 = var1 & 255; int var11 = var1 & 255;
int var12 = Math.round(var4 + (var8 - var4) * var2); int var12 = Math.round(var4 + (var8 - var4) * var2);
int var13 = Math.round(var5 + (var9 - var5) * var2); int var13 = Math.round(var5 + (var9 - var5) * var2);

View file

@ -16,11 +16,11 @@ public final class asv {
); );
public static int red(int var0) { public static int red(int var0) {
return var0 >> 16; return var0 >> 16 & 255;
} }
public static int green(int var0) { public static int green(int var0) {
return var0 >> 8; return var0 >> 8 & 255;
} }
public static int blue(int var0) { public static int blue(int var0) {
@ -28,7 +28,7 @@ public final class asv {
} }
public static int alpha(int var0) { public static int alpha(int var0) {
return var0 >> 24; return var0 >> 24 & 255;
} }
public static float redf(int var0) { public static float redf(int var0) {
@ -137,8 +137,8 @@ public final class asv {
return var1; return var1;
case -1782636761: case -1782636761:
var2 = Integer.parseInt(var0, (-1794596454 | 1794596470) + (-1794596454 & 1794596470)); var2 = Integer.parseInt(var0, (-1794596454 | 1794596470) + (-1794596454 & 1794596470));
var3 = var2 >> 16; var3 = var2 >> 16 & 255;
var4 = var2 >> 8; var4 = var2 >> 8 & 255;
var5 = var2 & 255; var5 = var2 & 255;
return new asu(new Color(var3, var4, var5)); return new asu(new Color(var3, var4, var5));
} }

View file

@ -93,15 +93,15 @@ public final class aue implements aqg {
} }
public static int clusterTop(int var0) { public static int clusterTop(int var0) {
return CLUSTER_RECTS[var0 * 5]; return CLUSTER_RECTS[var0 * (4) + 1];
} }
public static int clusterRight(int var0) { public static int clusterRight(int var0) {
return CLUSTER_RECTS[var0 * 6]; return CLUSTER_RECTS[var0 * (4) + 2];
} }
public static int clusterBottom(int var0) { public static int clusterBottom(int var0) {
return CLUSTER_RECTS[var0 * 7]; return CLUSTER_RECTS[var0 * (4) + 3];
} }
public static int bandTop(int var0) { public static int bandTop(int var0) {

View file

@ -50,8 +50,9 @@ public final class auk implements aqg {
case -2041829411: case -2041829411:
var2 = LINE_DEPTH.stream().map(var0x -> var0x.width).collect(Collectors.toCollection(LinkedHashSet::new)); var2 = LINE_DEPTH.stream().map(var0x -> var0x.width).collect(Collectors.toCollection(LinkedHashSet::new));
var3 = arj.linesDepthNoWrite(); var3 = arj.linesDepthNoWrite();
final RenderType var3f = var3;
var2.forEach(var2x -> { var2.forEach(var2x -> {
BufferBuilder var3x = arj.begin(var3); BufferBuilder var3x = arj.begin(var3f);
LINE_DEPTH.stream().filter(var1xx -> { LINE_DEPTH.stream().filter(var1xx -> {
int var3xx = 0; int var3xx = 0;
int var2xx = -137932082; int var2xx = -137932082;
@ -78,7 +79,7 @@ public final class auk implements aqg {
} }
} }
}).forEach(var2xx -> vertexLine(var0, var3x, var2xx.start, var2xx.end, var2xx.colorStart, var2xx.colorEnd)); }).forEach(var2xx -> vertexLine(var0, var3x, var2xx.start, var2xx.end, var2xx.colorStart, var2xx.colorEnd));
arj.draw(var3, var3x); arj.draw(var3f, var3x);
}); });
LINE_DEPTH.clear(); LINE_DEPTH.clear();
var4 = 1853296033; var4 = 1853296033;
@ -93,8 +94,9 @@ public final class auk implements aqg {
case -1429163925: case -1429163925:
var2 = LINE.stream().map(var0x -> var0x.width).collect(Collectors.toCollection(LinkedHashSet::new)); var2 = LINE.stream().map(var0x -> var0x.width).collect(Collectors.toCollection(LinkedHashSet::new));
var3 = arj.lines(); var3 = arj.lines();
final RenderType var3g = var3;
var2.forEach(var2x -> { var2.forEach(var2x -> {
BufferBuilder var3x = arj.begin(var3); BufferBuilder var3x = arj.begin(var3g);
LINE.stream().filter(var1xx -> { LINE.stream().filter(var1xx -> {
int var3xx = 0; int var3xx = 0;
int var2xx = 470152005; int var2xx = 470152005;
@ -122,7 +124,7 @@ public final class auk implements aqg {
} }
} }
}).forEach(var2xx -> vertexLine(var0, var3x, var2xx.start, var2xx.end, var2xx.colorStart, var2xx.colorEnd)); }).forEach(var2xx -> vertexLine(var0, var3x, var2xx.start, var2xx.end, var2xx.colorStart, var2xx.colorEnd));
arj.draw(var3, var3x); arj.draw(var3g, var3x);
}); });
LINE.clear(); LINE.clear();
var4 = -1675902102; var4 = -1675902102;
@ -132,7 +134,8 @@ public final class auk implements aqg {
case 862865238: case 862865238:
RenderType var6 = arj.positionColorDepth(); RenderType var6 = arj.positionColorDepth();
BufferBuilder var10 = arj.begin(var6); BufferBuilder var10 = arj.begin(var6);
QUAD_DEPTH.forEach(var2x -> vertexQuad(var1, var10, var2x.x, var2x.y, var2x.w, var2x.z, var2x.color)); final Pose var1f = var1;
QUAD_DEPTH.forEach(var2x -> vertexQuad(var1f, var10, var2x.x, var2x.y, var2x.w, var2x.z, var2x.color));
arj.draw(var6, var10); arj.draw(var6, var10);
QUAD_DEPTH.clear(); QUAD_DEPTH.clear();
var4 = 658345017; var4 = 658345017;
@ -149,7 +152,8 @@ public final class auk implements aqg {
case 1419775713: case 1419775713:
RenderType var5 = arj.positionColor(); RenderType var5 = arj.positionColor();
BufferBuilder var9 = arj.begin(var5); BufferBuilder var9 = arj.begin(var5);
QUAD.forEach(var2x -> vertexQuad(var1, var9, var2x.x, var2x.y, var2x.w, var2x.z, var2x.color)); final Pose var1g = var1;
QUAD.forEach(var2x -> vertexQuad(var1g, var9, var2x.x, var2x.y, var2x.w, var2x.z, var2x.color));
arj.draw(var5, var9); arj.draw(var5, var9);
QUAD.clear(); QUAD.clear();
var4 = 1932885929; var4 = 1932885929;
@ -233,18 +237,20 @@ public final class auk implements aqg {
break; break;
case 767297889: case 767297889:
var7 = var1.toAabbs(); var7 = var1.toAabbs();
final List var7f = var7;
final Vec3 var6f = var6;
SHAPE_OUTLINES.stream() SHAPE_OUTLINES.stream()
.filter(var1x -> var1x.boxes.equals(var7)) .filter(var1x -> var1x.boxes.equals(var7f))
.findFirst() .findFirst()
.ifPresentOrElse( .ifPresentOrElse(
var5x -> { var5x -> {
var5x.boxes var5x.boxes
.forEach( .forEach(
var5xx -> drawBox( var5xx -> drawBox(
var5xx.move(var6), var2, var3, (boolean)(((0)) != 0), var4, var5 var5xx.move(var6f), var2, var3, (boolean)(((0)) != 0), var4, var5
) )
); );
var5x.lines.forEach(var4xx -> drawLine(var4xx.start.add(var6), var4xx.end.add(var6), var2, var3, var5)); var5x.lines.forEach(var4xx -> drawLine(var4xx.start.add(var6f), var4xx.end.add(var6f), var2, var3, var5));
}, },
() -> { () -> {
ArrayList var1x = new ArrayList(); ArrayList var1x = new ArrayList();

View file

@ -778,7 +778,7 @@ public class aul {
var6 < 4; var6 < 4;
var6++ var6++
) { ) {
if (CORNER_RAYS[var6 * 4] if (CORNER_RAYS[var6 * (3) + 1]
> 0.0F) { > 0.0F) {
includeNdcPoint(CORNER_NDC_X[var6], CORNER_NDC_Y[var6]); includeNdcPoint(CORNER_NDC_X[var6], CORNER_NDC_Y[var6]);
} }
@ -786,8 +786,8 @@ public class aul {
for (int var12 = 0; var12 < 4; var12++) { for (int var12 = 0; var12 < 4; var12++) {
int var7 = (var12 + (-774300175 ^ 774300176) + ((-774300175 & 774300176) << 1)) % ((-951096963 | 951096967) + (-951096963 & 951096967)); int var7 = (var12 + (-774300175 ^ 774300176) + ((-774300175 & 774300176) << 1)) % ((-951096963 | 951096967) + (-951096963 & 951096967));
float var8 = CORNER_RAYS[var12 * 4]; float var8 = CORNER_RAYS[var12 * (3) + 1];
float var9 = CORNER_RAYS[var7 * 4]; float var9 = CORNER_RAYS[var7 * (3) + 1];
if ((var8 > 0.0F ? 1: (192060704 | -192060704) + (192060704 & -192060704)) if ((var8 > 0.0F ? 1: (192060704 | -192060704) + (192060704 & -192060704))
!= (var9 > 0.0F ? 1: (143981919 ^ -143981919) + ((143981919 & -143981919) << 1))) { != (var9 > 0.0F ? 1: (143981919 ^ -143981919) + ((143981919 & -143981919) << 1))) {
float var10 = var8 - var9; float var10 = var8 - var9;

View file

@ -1233,7 +1233,8 @@ public final class aum {
break; break;
case -1017059595: case -1017059595:
var2 = "evolution_customsky_march_" + var1; var2 = "evolution_customsky_march_" + var1;
var0[var1] = () -> var2; final String var2f = var2;
var0[var1] = () -> var2f;
var1++; var1++;
var3 = -1863061412; var3 = -1863061412;
break; break;
@ -1260,7 +1261,8 @@ public final class aum {
break; break;
case -1092652498: case -1092652498:
var2 = "evolution_customsky_bloom_" + var1; var2 = "evolution_customsky_bloom_" + var1;
var0[var1] = () -> var2; final String var2f = var2;
var0[var1] = () -> var2f;
var1++; var1++;
var3 = -2137893933; var3 = -2137893933;
break; break;
@ -1293,7 +1295,8 @@ public final class aum {
return var0; return var0;
case 1098190506: case 1098190506:
var2 = "evolution_customsky_target_" + var1; var2 = "evolution_customsky_target_" + var1;
var0[var1] = () -> var2; final String var2f = var2;
var0[var1] = () -> var2f;
var1++; var1++;
var3 = 2067898591; var3 = 2067898591;
break; break;
@ -1317,7 +1320,8 @@ public final class aum {
switch (var3) { switch (var3) {
case -1770467304: case -1770467304:
var2 = "evolution_customsky_bloom_target_" + var1; var2 = "evolution_customsky_bloom_target_" + var1;
var0[var1] = () -> var2; final String var2f = var2;
var0[var1] = () -> var2f;
var1++; var1++;
var3 = 758319209; var3 = 758319209;
break; break;

View file

@ -764,7 +764,8 @@ public final class aup {
return var0; return var0;
case 1238865745: case 1238865745:
var2 = "evolution_motionblur_target_" + var1; var2 = "evolution_motionblur_target_" + var1;
var0[var1] = () -> var2; final String var2f = var2;
var0[var1] = () -> var2f;
var1++; var1++;
var3 = -1970613668; var3 = -1970613668;
} }

View file

@ -26,7 +26,6 @@ public final class awb implements aqg {
private static final String QUICK_PREFIX = "Point "; private static final String QUICK_PREFIX = "Point ";
private static final String ID_FORMAT = "%08x%04x"; private static final String ID_FORMAT = "%08x%04x";
private static final int ID_COUNTER_MASK = 65535; private static final int ID_COUNTER_MASK = 65535;
private static final awb INSTANCE = new awb();
private final Map<String, List<avx>> worlds = new LinkedHashMap<>(); private final Map<String, List<avx>> worlds = new LinkedHashMap<>();
private final List<avx> unassigned = new ArrayList<>(); private final List<avx> unassigned = new ArrayList<>();
private final List<avx> shared = new ArrayList<>(); private final List<avx> shared = new ArrayList<>();
@ -1548,4 +1547,6 @@ public final class awb implements aqg {
var10000[7] = -38037; var10000[7] = -38037;
PALETTE = var10000; PALETTE = var10000;
} }
private static final awb INSTANCE = new awb();
} }

View file

@ -46,6 +46,7 @@ public final class dq extends dh {
switch (var7) { switch (var7) {
case -1694487340: case -1694487340:
var5 = var2[var4]; var5 = var2[var4];
final ams var5f = var5;
var6 = ((ams)var5).getLabel() var6 = ((ams)var5).getLabel()
.toLowerCase(Locale.ROOT) .toLowerCase(Locale.ROOT)
.replace( .replace(
@ -53,7 +54,7 @@ public final class dq extends dh {
(char)((-1156676000 ^ 1156676045) + ((-1156676000 & 1156676045) << 1)) (char)((-1156676000 ^ 1156676045) + ((-1156676000 & 1156676045) << 1))
); );
var1.then( var1.then(
((LiteralArgumentBuilder)literal(var6).executes(var1x -> start(var5, (-1504016657 ^ 1504016657) + ((-1504016657 & 1504016657) << 1)))) ((LiteralArgumentBuilder)literal(var6).executes(var1x -> start(var5f, (-1504016657 ^ 1504016657) + ((-1504016657 & 1504016657) << 1))))
.then( .then(
arg( arg(
"seconds", "seconds",
@ -63,7 +64,7 @@ public final class dq extends dh {
) )
.executes( .executes(
var1x -> start( var1x -> start(
var5, var5f,
IntegerArgumentType.getInteger(var1x, "seconds") IntegerArgumentType.getInteger(var1x, "seconds")
) )
) )

View file

@ -32,7 +32,8 @@ public class dw implements ArgumentType<String> {
while (true) { while (true) {
switch (var3) { switch (var3) {
case -1788986135: case -1788986135:
throw new DynamicCommandExceptionType(var1x -> Component.literal("You have no friend " + var2)).create(var2); final String var2f = var2;
throw new DynamicCommandExceptionType(var1x -> Component.literal("You have no friend " + var2f)).create(var2);
case -1552959420: case -1552959420:
return var2; return var2;
case -1078667301: case -1078667301:

View file

@ -291,8 +291,9 @@ public final class ej {
case -1560035544: case -1560035544:
return (boolean)(((0)) != 0); return (boolean)(((0)) != 0);
case -799431880: case -799431880:
final eg var1f = var1;
var3 = new Thread( var3 = new Thread(
() -> this.read(var1), () -> this.read(var1f),
"evo-discord-rpc-reader" "evo-discord-rpc-reader"
); );
var3.setDaemon((boolean)((((2067258406 | -2067258405) + (2067258406 & -2067258405))) != 0)); var3.setDaemon((boolean)((((2067258406 | -2067258405) + (2067258406 & -2067258405))) != 0));

View file

@ -60,6 +60,7 @@ public final class id {
case 286807880: case 286807880:
installed = (boolean)(((1)) != 0); installed = (boolean)(((1)) != 0);
var0 = Thread.getDefaultUncaughtExceptionHandler(); var0 = Thread.getDefaultUncaughtExceptionHandler();
final UncaughtExceptionHandler var0f = var0;
Thread.setDefaultUncaughtExceptionHandler( Thread.setDefaultUncaughtExceptionHandler(
(var1x, var2x) -> { (var1x, var2x) -> {
int var3 = -761060784; int var3 = -761060784;
@ -74,7 +75,7 @@ public final class id {
var1x.getName(), var1x.getName(),
var2x var2x
); );
if (var0 != null) { if (var0f != null) {
var3 = 1087126075; var3 = 1087126075;
} else { } else {
var3 = 884216481; var3 = 884216481;
@ -83,7 +84,7 @@ public final class id {
case 884216481: case 884216481:
return; return;
case 1087126075: case 1087126075:
var0.uncaughtException(var1x, var2x); var0f.uncaughtException(var1x, var2x);
var3 = 884216481; var3 = 884216481;
} }
} }
@ -429,7 +430,8 @@ public final class id {
var13 = 920923331; var13 = 920923331;
break; break;
case -1911981510: case -1911981510:
var9 = SIGNALS.computeIfAbsent(var8, var3x -> new il(fingerprint(var3x), var0, var5)); final long var5f = var5;
var9 = SIGNALS.computeIfAbsent(var8, var3x -> new il(fingerprint(var3x), var0, var5f));
var13 = 2048515706; var13 = 2048515706;
break; break;
case -1887975884: case -1887975884:

View file

@ -81,7 +81,6 @@ public final class in {
private static final float[] COS_TABLE = new float[512]; private static final float[] COS_TABLE = new float[512];
private static final float[] SIN_TABLE = new float[512]; private static final float[] SIN_TABLE = new float[512];
private static final int[] BIT_REVERSED = new int[1024]; private static final int[] BIT_REVERSED = new int[1024];
private static final in INSTANCE = new in();
private final AtomicBoolean running = new AtomicBoolean(); private final AtomicBoolean running = new AtomicBoolean();
private final boolean windows = System.getProperty("os.name", "") private final boolean windows = System.getProperty("os.name", "")
.toLowerCase(Locale.ROOT) .toLowerCase(Locale.ROOT)
@ -1017,4 +1016,6 @@ public final class in {
SIN_TABLE[var3] = (float)Math.sin(var1); SIN_TABLE[var3] = (float)Math.sin(var1);
} }
} }
private static final in INSTANCE = new in();
} }

View file

@ -244,11 +244,12 @@ public final class j {
var4 = -819570944; var4 = -819570944;
break; break;
case -1094948943: case -1094948943:
final i var3f = var3;
REGISTRY_MAP.put(var2, new CopyOnWriteArrayList<i>() { REGISTRY_MAP.put(var2, new CopyOnWriteArrayList<i>() {
private static final long serialVersionUID = 666L; private static final long serialVersionUID = 666L;
{ {
this.add(var3); this.add(var3f);
} }
}); });
var4 = -2092642494; var4 = -2092642494;

View file

@ -263,22 +263,24 @@ public final class ld {
break; break;
case 1855609648: case 1855609648:
var6 = var8; var6 = var8;
final String var5f = var5;
final int var6f = var6;
return var0.sendAsync(routed(var1, var5), BodyHandlers.ofString()) return var0.sendAsync(routed(var1, var5), BodyHandlers.ofString())
.handle( .handle(
(var7x, var8x) -> { (var7x, var8x) -> {
if (var8x == null && var7x.statusCode() < (816354886 | -816354386) + (816354886 & -816354386)) { if (var8x == null && var7x.statusCode() < (816354886 | -816354386) + (816354886 & -816354386)) {
markWorking(var5); markWorking(var5f);
return CompletableFuture.completedFuture(var7x); return CompletableFuture.completedFuture(var7x);
} else { } else {
Throwable var9x = unwrap(var8x); Throwable var9x = unwrap(var8x);
id.debug( id.debug(
Cif.NETWORK, Cif.NETWORK,
"api route {} failed: {}", "api route {} failed: {}",
var5, var5f,
var9x == null ? var7x.statusCode() : var9x.toString() var9x == null ? var7x.statusCode() : var9x.toString()
); );
HttpResponse var10 = var9x == null ? var7x : var4; HttpResponse var10 = var9x == null ? var7x : var4;
if (var6 == 0) { if (var6f == 0) {
return attempt(var0, var1, var2, var3 + 1, var10); return attempt(var0, var1, var2, var3 + 1, var10);
} else { } else {
return var10 != null ? CompletableFuture.completedFuture(var10) : CompletableFuture.failedFuture(var9x); return var10 != null ? CompletableFuture.completedFuture(var10) : CompletableFuture.failedFuture(var9x);

View file

@ -31,7 +31,6 @@ public final class mx {
private static final float LUMA_RED = 0.2126F; private static final float LUMA_RED = 0.2126F;
private static final float LUMA_GREEN = 0.7152F; private static final float LUMA_GREEN = 0.7152F;
private static final float LUMA_BLUE = 0.0722F; private static final float LUMA_BLUE = 0.0722F;
private static final mx CURRENT = new mx();
private final float[] fillAlpha = new float[ROLE_COUNT]; private final float[] fillAlpha = new float[ROLE_COUNT];
private final float[] borderAlpha = new float[ROLE_COUNT]; private final float[] borderAlpha = new float[ROLE_COUNT];
private final float[] radiusScale = new float[ROLE_COUNT]; private final float[] radiusScale = new float[ROLE_COUNT];
@ -656,4 +655,6 @@ public final class mx {
var10000[3] = -0.70710677F; var10000[3] = -0.70710677F;
CORNER_DIR_Y = var10000; CORNER_DIR_Y = var10000;
} }
private static final mx CURRENT = new mx();
} }

View file

@ -1016,6 +1016,7 @@ public final class nj {
switch (var4) { switch (var4) {
case 648974545: case 648974545:
var3 = var1[var2]; var3 = var1[var2];
final Object var3f = var3;
var0.add( var0.add(
new ni( new ni(
titleCase(((nk)var3).name()), titleCase(((nk)var3).name()),
@ -1033,7 +1034,7 @@ public final class nj {
switch (var4x) { switch (var4x) {
case -946274765: case -946274765:
var3x = var5x; var3x = var5x;
var1x.setBackdrop(new nl((nk)var3, var3x, var2x.speed(), var2x.scale())); var1x.setBackdrop(new nl((nk)var3f, var3x, var2x.speed(), var2x.scale()));
return; return;
case 154502056: case 154502056:
var5x = 0.5F; var5x = 0.5F;
@ -1042,7 +1043,7 @@ public final class nj {
case 539912552: case 539912552:
default: default:
var2x = var1x.getBackdrop(); var2x = var1x.getBackdrop();
if (var3 != nk.NONE) { if (var3f != nk.NONE) {
var4x = 729158470; var4x = 729158470;
} else { } else {
var4x = 1812314000; var4x = 1812314000;
@ -1073,7 +1074,7 @@ public final class nj {
break; break;
case 204379288: case 204379288:
default: default:
if (var1x.getBackdrop().mode() == var3) { if (var1x.getBackdrop().mode() == var3f) {
var2x = -2125372483; var2x = -2125372483;
} else { } else {
var2x = 346227164; var2x = 346227164;
@ -1199,6 +1200,7 @@ public final class nj {
case 1917302032: case 1917302032:
var5 = var2[var4]; var5 = var2[var4];
var6 = (ns)var5; var6 = (ns)var5;
final ns var6f = var6;
var0.add( var0.add(
new ni( new ni(
titleCase(var6.name()), titleCase(var6.name()),
@ -1207,7 +1209,7 @@ public final class nj {
0.0F, 0.0F,
var1++, var1++,
var1x -> { var1x -> {
var1x.setPalette(var1x.getPalette().withGenerated((boolean)(((1)) != 0)).withPolarity(var6)); var1x.setPalette(var1x.getPalette().withGenerated((boolean)(((1)) != 0)).withPolarity(var6f));
nd.apply(var1x); nd.apply(var1x);
}, },
var1x -> { var1x -> {
@ -1221,7 +1223,7 @@ public final class nj {
var2x = 654770840; var2x = 654770840;
break; break;
case -1846610250: case -1846610250:
if (var1x.getPalette().polarity() == var6) { if (var1x.getPalette().polarity() == var6f) {
var2x = -770918860; var2x = -770918860;
} else { } else {
var2x = -1931371217; var2x = -1931371217;

View file

@ -1140,6 +1140,7 @@ public final class op {
var4 = var1[var3]; var4 = var1[var3];
var5 = titleCase(var4.name()); var5 = titleCase(var4.name());
var6 = var5.toLowerCase(Locale.ROOT); var6 = var5.toLowerCase(Locale.ROOT);
final nz var4f = var4;
var0.add( var0.add(
oo.slider( oo.slider(
or.SHAPE, or.SHAPE,
@ -1148,9 +1149,9 @@ public final class op {
0.0F, 0.0F,
24.0F, 24.0F,
0.5F, 0.5F,
var1x -> var1x.getElevation().softness(var4), var1x -> var1x.getElevation().softness(var4f),
(var1x, var2x) -> var1x.setElevation(var1x.getElevation().withLevel(var4, var2x, var1x.getElevation().alpha(var4))), (var1x, var2x) -> var1x.setElevation(var1x.getElevation().withLevel(var4f, var2x, var1x.getElevation().alpha(var4f))),
var1x -> var1x.getDefaultElevation().softness(var4) var1x -> var1x.getDefaultElevation().softness(var4f)
) )
); );
var0.add( var0.add(
@ -1161,9 +1162,9 @@ public final class op {
0.0F, 0.0F,
1.0F, 1.0F,
0.02F, 0.02F,
var1x -> var1x.getElevation().alpha(var4), var1x -> var1x.getElevation().alpha(var4f),
(var1x, var2x) -> var1x.setElevation(var1x.getElevation().withLevel(var4, var1x.getElevation().softness(var4), var2x)), (var1x, var2x) -> var1x.setElevation(var1x.getElevation().withLevel(var4f, var1x.getElevation().softness(var4f), var2x)),
var1x -> var1x.getDefaultElevation().alpha(var4) var1x -> var1x.getDefaultElevation().alpha(var4f)
) )
); );
var3++; var3++;
@ -1192,6 +1193,7 @@ public final class op {
case -936362229: case -936362229:
var4 = var1[var3]; var4 = var1[var3];
var5 = titleCase(((ob)var4).name()); var5 = titleCase(((ob)var4).name());
final ob var4f = var4;
var0.add( var0.add(
oo.slider( oo.slider(
or.MOTION, or.MOTION,
@ -1200,9 +1202,9 @@ public final class op {
ob.INSTANT.baseMillis() * 0.5F, ob.INSTANT.baseMillis() * 0.5F,
ob.DELIBERATE.baseMillis() * 2.0F, ob.DELIBERATE.baseMillis() * 2.0F,
10.0F, 10.0F,
var1x -> var1x.getMotion().duration(var4), var1x -> var1x.getMotion().duration(var4f),
(var1x, var2x) -> var1x.setMotion(var1x.getMotion().withDuration(var4, Math.round(var2x))), (var1x, var2x) -> var1x.setMotion(var1x.getMotion().withDuration(var4f, Math.round(var2x))),
var1x -> var1x.getDefaultMotion().duration(var4) var1x -> var1x.getDefaultMotion().duration(var4f)
) )
); );
var3++; var3++;
@ -1280,6 +1282,7 @@ public final class op {
var5 = var2[var4]; var5 = var2[var4];
var6 = titleCase(var5.name()); var6 = titleCase(var5.name());
var7 = var6.toLowerCase(Locale.ROOT); var7 = var6.toLowerCase(Locale.ROOT);
final oe var5f = var5;
var0.add( var0.add(
oo.slider( oo.slider(
or.LAYOUT, or.LAYOUT,
@ -1288,9 +1291,9 @@ public final class op {
4.0F, 4.0F,
24.0F, 24.0F,
0.5F, 0.5F,
var1x -> var1x.getTypography().sizes()[var5.ordinal()], var1x -> var1x.getTypography().sizes()[var5f.ordinal()],
(var1x, var2x) -> var1x.setTypography(var1x.getTypography().withSize(var5, var2x)), (var1x, var2x) -> var1x.setTypography(var1x.getTypography().withSize(var5f, var2x)),
var1x -> var1x.getDefaultTypography().sizes()[var5.ordinal()] var1x -> var1x.getDefaultTypography().sizes()[var5f.ordinal()]
) )
); );
var0.add( var0.add(
@ -1299,11 +1302,11 @@ public final class op {
var6 + " font", var6 + " font",
"Font family of the " + var7 + " text role", "Font family of the " + var7 + " text role",
var1, var1,
var1x -> titleCase(var1x.getTypography().family(var5).name()), var1x -> titleCase(var1x.getTypography().family(var5f).name()),
(var1x, var2x) -> var1x.setTypography( (var1x, var2x) -> var1x.setTypography(
var1x.getTypography().withFamily(var5, byTitle(oa.values(), var2x, var1x.getTypography().family(var5))) var1x.getTypography().withFamily(var5f, byTitle(oa.values(), var2x, var1x.getTypography().family(var5f)))
), ),
var1x -> titleCase(var1x.getDefaultTypography().family(var5).name()) var1x -> titleCase(var1x.getDefaultTypography().family(var5f).name())
) )
); );
var4++; var4++;
@ -1323,6 +1326,7 @@ public final class op {
switch (var5) { switch (var5) {
case -2081731353: case -2081731353:
var4 = var1[var3]; var4 = var1[var3];
final od var4f = var4;
var0.add( var0.add(
oo.slider( oo.slider(
or.LAYOUT, or.LAYOUT,
@ -1331,9 +1335,9 @@ public final class op {
0.0F, 0.0F,
32.0F, 32.0F,
0.5F, 0.5F,
var1x -> var1x.getSpacing().steps()[var4.ordinal()], var1x -> var1x.getSpacing().steps()[var4f.ordinal()],
(var1x, var2x) -> var1x.setSpacing(var1x.getSpacing().withStep(var4, var2x)), (var1x, var2x) -> var1x.setSpacing(var1x.getSpacing().withStep(var4f, var2x)),
var1x -> var1x.getDefaultSpacing().steps()[var4.ordinal()] var1x -> var1x.getDefaultSpacing().steps()[var4f.ordinal()]
) )
); );
var3++; var3++;
@ -1415,6 +1419,7 @@ public final class op {
var5 = var2[var4]; var5 = var2[var4];
var6 = titleCase(var5.name()); var6 = titleCase(var5.name());
var7 = var6.toLowerCase(Locale.ROOT); var7 = var6.toLowerCase(Locale.ROOT);
final aso var5f = var5;
var0.add( var0.add(
oo.slider( oo.slider(
or.SHAPE, or.SHAPE,
@ -1423,9 +1428,9 @@ public final class op {
0.0F, 0.0F,
3.0F, 3.0F,
0.05F, 0.05F,
var1x -> var1x.getGeometry().roleRadiusScale()[var5.ordinal()], var1x -> var1x.getGeometry().roleRadiusScale()[var5f.ordinal()],
(var1x, var2x) -> var1x.setGeometry(var1x.getGeometry().withRoleRadiusScale(var5, var2x)), (var1x, var2x) -> var1x.setGeometry(var1x.getGeometry().withRoleRadiusScale(var5f, var2x)),
var1x -> var1x.getDefaultGeometry().roleRadiusScale()[var5.ordinal()] var1x -> var1x.getDefaultGeometry().roleRadiusScale()[var5f.ordinal()]
) )
); );
var0.add( var0.add(
@ -1436,9 +1441,9 @@ public final class op {
0.0F, 0.0F,
3.0F, 3.0F,
0.05F, 0.05F,
var1x -> var1x.getEffects().roleNeonScale()[var5.ordinal()], var1x -> var1x.getEffects().roleNeonScale()[var5f.ordinal()],
(var1x, var2x) -> var1x.setEffects(var1x.getEffects().withRoleNeonScale(var5, var2x)), (var1x, var2x) -> var1x.setEffects(var1x.getEffects().withRoleNeonScale(var5f, var2x)),
var1x -> var1x.getDefaultEffects().roleNeonScale()[var5.ordinal()] var1x -> var1x.getDefaultEffects().roleNeonScale()[var5f.ordinal()]
) )
); );
var0.add( var0.add(
@ -1447,9 +1452,9 @@ public final class op {
var6 + " glass", var6 + " glass",
"How " + var7 + " surfaces react to Liquid Glass", "How " + var7 + " surfaces react to Liquid Glass",
var1, var1,
var1x -> tierName(var1x.getGlass().roleTier()[var5.ordinal()]), var1x -> tierName(var1x.getGlass().roleTier()[var5f.ordinal()]),
(var1x, var2x) -> var1x.setGlass(var1x.getGlass().withTier(var5, tierByName(var2x))), (var1x, var2x) -> var1x.setGlass(var1x.getGlass().withTier(var5f, tierByName(var2x))),
var1x -> tierName(var1x.getDefaultGlass().roleTier()[var5.ordinal()]) var1x -> tierName(var1x.getDefaultGlass().roleTier()[var5f.ordinal()])
) )
); );
var4++; var4++;

View file

@ -232,7 +232,11 @@ public class qq extends qx {
case 1861099087: case 1861099087:
var4 = var13; var4 = var13;
var10 = var4; var10 = var4;
this.modules.computeIfAbsent(var8, var5x -> new qo(this, var10, var8, var6, var9)); final String var6f = var6;
final String var8f = var8;
final qp var9f = var9;
final Component var10f = var10;
this.modules.computeIfAbsent(var8, var5x -> new qo(this, var10f, var8f, var6f, var9f));
this.currentStaffKeys.add(var8); this.currentStaffKeys.add(var8);
var11 = 1447168164; var11 = 1447168164;
break; break;

View file

@ -6,7 +6,6 @@ import java.util.function.Supplier;
@rn(name = "Replay", category = rl.MISC, description = "Keeps the last seconds of gameplay ready to save, records clips and trims them in place") @rn(name = "Replay", category = rl.MISC, description = "Keeps the last seconds of gameplay ready to save, records clips and trims them in place")
public final class ti extends rm { public final class ti extends rm {
public static final ti INSTANCE = new ti();
private static final String AUDIO_DEVICE_FAILURE = "clip audio device lookup failed"; private static final String AUDIO_DEVICE_FAILURE = "clip audio device lookup failed";
private static final String RESOLUTION_LOW = "480p"; private static final String RESOLUTION_LOW = "480p";
private static final String RESOLUTION_MEDIUM = "720p"; private static final String RESOLUTION_MEDIUM = "720p";
@ -542,4 +541,6 @@ public final class ti extends rm {
var10000[2] = 480; var10000[2] = 480;
CAPTURE_HEIGHTS = var10000; CAPTURE_HEIGHTS = var10000;
} }
public static final ti INSTANCE = new ti();
} }

View file

@ -432,6 +432,9 @@ public final class tk extends rm {
break; break;
case 1219982996: case 1219982996:
var9 = withAlpha(var7, 0.28F); var9 = withAlpha(var7, 0.28F);
final List var5f = var5;
final Vec3 var6f = var6;
final int var9f = var9;
var4.submitCustomGeometry(var3, arj.filledBox(), (var3x, var4x) -> { var4.submitCustomGeometry(var3, arj.filledBox(), (var3x, var4x) -> {
Iterator var5x = null; Iterator var5x = null;
BlockPos var6x = null; BlockPos var6x = null;
@ -443,7 +446,7 @@ public final class tk extends rm {
return; return;
case -412359412: case -412359412:
var6x = (BlockPos)var5x.next(); var6x = (BlockPos)var5x.next();
addFilledBox(var4x, var3x, new AABB(var6x).inflate(0.002), var6, var9); addFilledBox(var4x, var3x, new AABB(var6x).inflate(0.002), var6f, var9f);
var7x = 1009276439; var7x = 1009276439;
break; break;
case 1009276439: case 1009276439:
@ -455,7 +458,7 @@ public final class tk extends rm {
break; break;
case 1128586463: case 1128586463:
default: default:
var5x = var5.iterator(); var5x = var5f.iterator();
var7x = 1009276439; var7x = 1009276439;
} }
} }

View file

@ -1326,6 +1326,14 @@ public final class tr extends rm {
var13 = var11.y(); var13 = var11.y();
var14 = var11.z(); var14 = var11.z();
var15 = this.dropCount; var15 = this.dropCount;
final float var6f = var6;
final float var8f = var8;
final float var9f = var9;
final float var10f = var10;
final float var12f = var12;
final float var13f = var13;
final float var14f = var14;
final int var15f = var15;
var1.submitCustomGeometry(var2, arj.positionColorDepthNoWrite(), (var11x, var12x) -> { var1.submitCustomGeometry(var2, arj.positionColorDepthNoWrite(), (var11x, var12x) -> {
float var13x = 0.0F; float var13x = 0.0F;
float var14x = 0.0F; float var14x = 0.0F;
@ -1364,9 +1372,9 @@ public final class tr extends rm {
var23x /= var26x; var23x /= var26x;
var24x /= var26x; var24x /= var26x;
var25x /= var26x; var25x /= var26x;
var27 = Math.max(var9, var21x * 0.002F); var27 = Math.max(var9f, var21x * 0.002F);
var28 = var8 * this.dropSpeed[var17x]; var28 = var8f * this.dropSpeed[var17x];
var29 = var10 * var22x * this.dropAlpha[var17x]; var29 = var10f * var22x * this.dropAlpha[var17x];
var30 = var18x - var14x * var28; var30 = var18x - var14x * var28;
var31 = var19x - var15x * var28; var31 = var19x - var15x * var28;
var32 = var20x - var16x * var28; var32 = var20x - var16x * var28;
@ -1384,7 +1392,7 @@ public final class tr extends rm {
var39 = 1825865055; var39 = 1825865055;
break; break;
case -959984870: case -959984870:
if (var17x < var15) { if (var17x < var15f) {
var39 = 1174780233; var39 = 1174780233;
} else { } else {
var39 = -360757082; var39 = -360757082;
@ -1395,9 +1403,9 @@ public final class tr extends rm {
break; break;
case -749415779: case -749415779:
default: default:
var13x = Mth.sqrt((float)(this.windX * this.windX + var6 * var6 + this.windZ * this.windZ)); var13x = Mth.sqrt((float)(this.windX * this.windX + var6f * var6f + this.windZ * this.windZ));
var14x = (float)(this.windX / var13x); var14x = (float)(this.windX / var13x);
var15x = -var6 / var13x; var15x = -var6f / var13x;
var16x = (float)(this.windZ / var13x); var16x = (float)(this.windZ / var13x);
var17x = 0; var17x = 0;
var39 = -959984870; var39 = -959984870;
@ -1449,7 +1457,7 @@ public final class tr extends rm {
var39 = -959984870; var39 = -959984870;
break; break;
case 2141588167: case 2141588167:
if ((var18x * var12 + var19x * var13 + var20x * var14) / var21x < -0.35F) { if ((var18x * var12f + var19x * var13f + var20x * var14f) / var21x < -0.35F) {
var39 = -1707118834; var39 = -1707118834;
} else { } else {
var39 = 1086757984; var39 = 1086757984;
@ -1521,6 +1529,11 @@ public final class tr extends rm {
var9 = var3.forwardVector(); var9 = var3.forwardVector();
var10 = this.splashSize; var10 = this.splashSize;
var11 = this.splashHead; var11 = this.splashHead;
final long var6f = var6;
final float var8f = var8;
final Vector3fc var9f = var9;
final int var10f = var10;
final int var11f = var11;
var1.submitCustomGeometry(var2, arj.positionColorDepthNoWrite(), (var9x, var10x) -> { var1.submitCustomGeometry(var2, arj.positionColorDepthNoWrite(), (var9x, var10x) -> {
int var11x = 0; int var11x = 0;
int var12x = 0; int var12x = 0;
@ -1571,15 +1584,15 @@ public final class tr extends rm {
var35 = 746061916; var35 = 746061916;
break; break;
case -295964581: case -295964581:
if ((var14x * var9.x() + var16x * var9.y() + var18 * var9.z()) / var20 < -0.35F) { if ((var14x * var9f.x() + var16x * var9f.y() + var18 * var9f.z()) / var20 < -0.35F) {
var35 = -117608828; var35 = -117608828;
} else { } else {
var35 = 78890872; var35 = 78890872;
} }
break; break;
case -170422428: case -170422428:
var12x = (var11 + var11x) % (128); var12x = (var11f + var11x) % (128);
var13x = (float)(var6 - this.splashStart[var12x]) / 360.0F; var13x = (float)(var6f - this.splashStart[var12x]) / 360.0F;
if (!(var13x < 0.0F)) { if (!(var13x < 0.0F)) {
var35 = 1779742863; var35 = 1779742863;
} else { } else {
@ -1593,12 +1606,12 @@ public final class tr extends rm {
var22 = 1.0F - (1.0F - var13x) * (1.0F - var13x); var22 = 1.0F - (1.0F - var13x) * (1.0F - var13x);
var23 = Mth.lerp(var22, 0.05F, 0.26F); var23 = Mth.lerp(var22, 0.05F, 0.26F);
var24 = Math.max(0.0F, var23 - 0.032F); var24 = Math.max(0.0F, var23 - 0.032F);
var25 = withAlpha(var5, var8 * (1.0F - var13x) * (1.0F - var13x)); var25 = withAlpha(var5, var8f * (1.0F - var13x) * (1.0F - var13x));
var26 = 0; var26 = 0;
var35 = -2040229467; var35 = -2040229467;
break; break;
case 746061916: case 746061916:
if (var11x < var10) { if (var11x < var10f) {
var35 = -170422428; var35 = -170422428;
} else { } else {
var35 = 778126713; var35 = 778126713;

Some files were not shown because too many files have changed in this diff Show more