/storage/aboba/evovis-client/src/main/java/defpackage/arh.java:127: error: local variables referenced from a lambda expression must be final or effectively final QUAD.forEach(var2x -> quad(var2, var4, var2x.x, var2x.y, var2x.width, var2x.height, var2x.color)); ^ /storage/aboba/evovis-client/src/main/java/defpackage/arh.java:127: error: local variables referenced from a lambda expression must be final or effectively final QUAD.forEach(var2x -> quad(var2, var4, var2x.x, var2x.y, var2x.width, var2x.height, var2x.color)); ^ Note: Some input files use or override a deprecated API. Note: Recompile with -Xlint:deprecation for details. Note: Some input files use unchecked or unsafe operations. Note: Recompile with -Xlint:unchecked for details. 2 errors FAILURE: Build failed with an exception. * What went wrong: Execution failed for task ':compileJava' (registered by plugin class 'org.gradle.api.plugins.JavaBasePlugin'). > Compilation failed; see the compiler output below. /storage/aboba/evovis-client/src/main/java/defpackage/arh.java:127: error: local variables referenced from a lambda expression must be final or effectively final QUAD.forEach(var2x -> quad(var2, var4, var2x.x, var2x.y, var2x.width, var2x.height, var2x.color)); ^ 2 errors * Try: > Check your code and dependencies to fix the compilation error(s) > Run with --scan to get full insights from a Build Scan (powered by Develocity). BUILD FAILED in 8s