/storage/aboba/evovis-client/src/main/java/defpackage/tk.java:446: error: local variables referenced from a lambda expression must be final or effectively final addFilledBox(var4x, var3x, new AABB(var6x).inflate(0.002), var6, var9); ^ /storage/aboba/evovis-client/src/main/java/defpackage/tk.java:446: error: local variables referenced from a lambda expression must be final or effectively final addFilledBox(var4x, var3x, new AABB(var6x).inflate(0.002), var6, var9); ^ /storage/aboba/evovis-client/src/main/java/defpackage/tk.java:458: error: local variables referenced from a lambda expression must be final or effectively final var5x = var5.iterator(); ^ Note: Some input files use or override a deprecated API. Note: Recompile with -Xlint:deprecation for details. Note: Some input files use unchecked or unsafe operations. Note: Recompile with -Xlint:unchecked for details. 3 errors FAILURE: Build failed with an exception. * What went wrong: Execution failed for task ':compileJava' (registered by plugin class 'org.gradle.api.plugins.JavaBasePlugin'). > Compilation failed; see the compiler output below. /storage/aboba/evovis-client/src/main/java/defpackage/tk.java:446: error: local variables referenced from a lambda expression must be final or effectively final addFilledBox(var4x, var3x, new AABB(var6x).inflate(0.002), var6, var9); ^ 3 errors * Try: > Check your code and dependencies to fix the compilation error(s) > Run with --scan to get full insights from a Build Scan (powered by Develocity). BUILD FAILED in 7s